{"text_format":"1","workbook":"xlsx","n_sheets":11,"sheets":["T","DE","Ibilgailu-mota","Ibilgailuaren Ezaugarriak","Erosketa kostuak","Ibilgailuan doazen langileen ko","Aseguruak esta zerga arloko kos","Kostu aldakorrak","Zeharkako kostuak","Emaitzak","Zerbitzuaren kostua"],"not_rendered":{"charts":6,"images":5,"macros":1,"external_links":0,"defined_names":3,"comments":0,"pivot_tables":0},"unopened":[],"bounds":{"document_bytes":16777216,"sheet_cells":100000,"rows_first":2000,"rows_last":500,"rows_between":2000,"halvings":0,"cell_chars":16384,"cell_head_chars":4096},"cells_cut":0,"cells_raw":0,"read":"whole","date_system":"1900"}

{"sheet":"T","index":0,"n_rows":6,"n_cols":8,"rows_kept":6,"cut":false,"hidden":true,"merged":[]}
["Tipo de vehículo",null,"Pregunta",null,null,"Adquisicion",null,"Editar"]
["15 metroko autobusa","T17","Bai","S",null," EROSKETA"]
["12 metroko autobusa","T18","Ez","N",null,"ALOKAIRUA, LEASING..."]
["9 metroko autobusa","T19"]
["Mikrobusa","T20"]
["Autobus arrunta (aurreko kategorietan sartzen ez diren gainerako ibilgailu guztiak)","T21"]

{"sheet":"DE","index":1,"n_rows":90,"n_cols":36,"rows_kept":90,"cut":false,"hidden":true,"merged":[[36,13,36,14]]}
[null,null,"T17A","T17","T18A","T18","T19A","T19","T20A","T20","T21A","T21"]
[null,"Descripción:"," ","Autocar de 15 metros"," ","Autocar de 12 metros"," ","Autocar de 9 metros"," ","Microbús"," ","Autocar genérico (autocares no englobados en las categorías anteriores)",null,null,null,null,null,null,null,null,null,null,null,null,null,null," ",null,null,null,null,null,null,null,null,"03/07/2025"]
[null,"Tipo interes",null,0.0453,null,0.0453,null,0.0453,null,0.0453,null,0.0453]
[null,"Número de plazas incluido el conductor",null,65.0,null,55.0,null,35.0,null,25.0,null,55.0]
[null,"Potencia (CV)",null,420.0,null,380.0,null,280.0,null,160.0,null,380.0]
[null,"Masa Máxima Autorizada (kg)",null,0.0,null,0.0,null,0.0,null,0.0,null,0.0]
[null,"Número de ejes",null,3.0,null,2.0,null,2.0,null,2.0,null,2.0]
[null,"Kilómetros recorridos anualmente",null,75000.0,null,65000.0,null,50000.0,null,40000.0,null,65000.0]
[null,"Kilómetros facturados de los recorridos al año (km)",95.0,{"$f":"ROUND(D8*C9/100,2)","v":71250.0},95.0,{"$f":"F8*E9/100","v":61750.0},95.0,{"$f":"H8*G9/100","v":47500.0},95.0,{"$f":"J8*I9/100","v":38000.0},95.0,{"$f":"L8*K9/100","v":61750.0}]
[null,"Consumo medio (litros/100km)",null,30.0,null,26.0,null,21.0,null,15.5,null,26.0]
[null,"Horas trabajadas al año",null,1800.0,null,1800.0,null,1800.0,null,1800.0,null,1800.0]
[null,"Horas facturadas de las trabajadas al año (h,%)",91.0,{"$f":"ROUND(D11*C12/100,0)","v":1638.0},91.0,{"$f":"F11*E12/100","v":1638.0},91.0,{"$f":"H11*G12/100","v":1638.0},91.0,{"$f":"J11*I12/100","v":1638.0},91.0,{"$f":"L11*K12/100","v":1638.0}]
[null,"Kilómetros con viajeros de los recorridos al año (km,%)",90.0,{"$f":"ROUND(D8*C13/100,2)","v":67500.0},90.0,{"$f":"F8*E13/100","v":58500.0},90.0,{"$f":"H8*G13/100","v":45000.0},90.0,{"$f":"J8*I13/100","v":36000.0},90.0,{"$f":"L8*K13/100","v":58500.0}]
[null,"Ocupación media de las plazas en los kilómetros recorridos con viajeros (viajeros/autocar,%)",80.0,{"$f":"ROUND((D4-1)*C14/100,0)","v":51.0},80.0,{"$f":"ROUND((F4-1)*E14/100,0)","v":43.0},80.0,{"$f":"ROUND((H4-1)*G14/100,0)","v":27.0},80.0,{"$f":"ROUND((J4-1)*I14/100,0)","v":19.0},80.0,{"$f":"ROUND((L4-1)*K14/100,0)","v":43.0}]
[null,"Producción anual: Viajeros x Kilómetros",null,{"$f":"D13*D14","v":3442500.0},null,{"$f":"F13*F14","v":2515500.0},null,{"$f":"H13*H14","v":1215000.0},null,{"$f":"J13*J14","v":684000.0},null,{"$f":"L13*L14","v":2515500.0}]
[null,"Pago de alquiler o leasing anual (€)",null,0.0,null,0.0,null,0.0,null,0.0,null,0.0,"CHASIS"]
[null,"Precio de adquisición (precio de tarifa - descuento) sin IVA (€)",null,131408.55,null,116029.69,null,78861.75,null,40274.0,null,116029.69]
[null,"Vida útil (años)",null,12.0,null,12.0,null,12.0,null,12.0,null,12.0]
[null,"Valor residual sin IVA (€)",20.0,{"$f":"ROUND(D17*C19/100,0)","v":26282.0},20.0,{"$f":"ROUND(F17*E19/100,0)","v":23206.0},20.0,{"$f":"ROUND(H17*G19/100,0)","v":15772.0},20.0,{"$f":"ROUND(J17*I19/100,0)","v":8055.0},20.0,{"$f":"ROUND(L17*K19/100,0)","v":23206.0}]
[null,"AMORTIZACION DEL CHASIS",null,{"$f":"IFERROR(ROUND((D17-D19-D80)/D18,0),0)","v":8246.0},null,{"$f":"IFERROR(ROUND((F17-F19-F80)/F18,0),0)","v":7451.0},null,{"$f":"IFERROR(ROUND((H17-H19-H80)/H18,0),0)","v":5069.0},null,{"$f":"IFERROR(ROUND((J17-J19-J80)/J18,0),0)","v":2562.0},null,{"$f":"IFERROR(ROUND((L17-L19-L80)/L18,0),0)","v":7451.0}]
{"$rows_left_out":71}
{"sheet":"Ibilgailu-mota","index":2,"n_rows":16,"n_cols":7,"rows_kept":16,"cut":false,"hidden":false,"merged":[]}
[]
[]
[]
[]
[]
[null,null,"1. Ibilgailu-mota hautatu"]
[]
[]
[]
[null,null,"Ibilgailu-mota:",null,{"$f":"VLOOKUP(F10,T!A2:B17,2,0)","v":"T17"},"15 metroko autobusa"]
[]
[]
[null,null,"¿Desea cargar los datos estadísticos en los campos a rellenar?",null,null,null,"No"]
[]
[]
[null,null,"Kalkulu-formularioetara gehitutako datu estatistikoekin simulazioa hasi nahi duzu?"]

{"sheet":"Ibilgailuaren Ezaugarriak","index":3,"n_rows":39,"n_cols":13,"rows_kept":39,"cut":false,"hidden":false,"merged":[[10,9,10,13]]}
[]
[]
[]
[]
[]
[null,null,"1. Ibilgailuaren Ezaugarriak"]
[]
[]
[null,null,"Ibilgailuaren ezaugarri teknikoak ",null,null,null,null,null,null,null,null,"Datu estadistikoak",{"$f":"DE!$AJ$2","v":"19/06/2025"}]
[]
[null,null,"Deskripzioa:",null,null,null,null,null,null,{"$f":"IF(HLOOKUP('Ibilgailu-mota'!$E$10,DE!$D$1:$AX$15,2,0)=\"\",\"\",HLOOKUP('Ibilgailu-mota'!$E$10,DE!$D$1:$AX$15,2,0))","v":"Autocar de 15 metros"}]
[]
[null,null,"Plaza kopurua, gidaria barne ",null,null,null,null,null,null,null,null,{"$f":"IF(HLOOKUP('Ibilgailu-mota'!$E$10,DE!$D$1:$AK$15,4,0)=\"\",\"\",HLOOKUP('Ibilgailu-mota'!$E$10,DE!$D$1:$AK$15,4,0))","v":15}]
[]
[null,null,"Potentzia (CV) ",null,null,null,null,null,null,null,null,{"$f":"IF(HLOOKUP('Ibilgailu-mota'!$E$10,DE!$D$1:$AK$15,5,0)=\"\",\"\",HLOOKUP('Ibilgailu-mota'!$E$10,DE!$D$1:$AK$15,5,0))","v":15}]
[]
[null,null,"MMA ( Tm)",null,null,null,null,null,null,null,null,{"$f":"IF(HLOOKUP('Ibilgailu-mota'!$E$10,DE!$D$1:$AK$15,6,0)=\"\",\"\",HLOOKUP('Ibilgailu-mota'!$E$10,DE!$D$1:$AK$15,6,0))","v":0}]
[]
[null,null,"Ardatz-kopurua ",null,null,null,null,null,null,null,null,{"$f":"IF(HLOOKUP('Ibilgailu-mota'!$E$10,DE!$D$1:$AK$15,7,0)=\"\",\"\",HLOOKUP('Ibilgailu-mota'!$E$10,DE!$D$1:$AK$15,7,0))","v":4}]
[]
{"$rows_left_out":20}
{"sheet":"Erosketa kostuak","index":4,"n_rows":63,"n_cols":13,"rows_kept":63,"cut":false,"hidden":false,"merged":[[10,9,10,10],[28,9,28,10],[46,9,46,10]]}
[]
[]
[]
[]
[]
[null,null,"2. Erosketa kostuak"]
[]
[]
[null,null,"Autobusaren bastidorea ",null,null,null,null,null,null,null,null,"Datu estadistikoak",{"$f":"DE!$AJ$2","v":"19/06/2025"}]
[null,null,null,null,null,null,null,null,null,null,null,{"$f":"IF(HLOOKUP('Ibilgailu-mota'!$E$10,DE!$D$1:$AX$286,3,0)=\"\",\"\",HLOOKUP('Ibilgailu-mota'!$E$10,DE!$D$1:$AX$286,3,0))","v":5.6099999999999997E-2}]
[null,null,"Autobusaren bastidorea: ",null,null,null,null,null,null," EROSKETA"]
[]
[null,null,"Urteko alokairu edo leasing-aren ordainketa (€)",null,null,null,null,null,null,null,null,{"$f":"IF(HLOOKUP('Ibilgailu-mota'!$E$10,DE!$D$1:$AX$286,16,0)=\"\",\"\",HLOOKUP('Ibilgailu-mota'!$E$10,DE!$D$1:$AX$286,16,0))","v":0}]
[]
[null,null,"Bastidorearen erosketa (€)"]
[]
[null,null,"Erosketa-prezioa (tarifa prezioa-deskontua), BEZ gabe (€)",null,null,null,null,null,null,null,null,{"$f":"IF(HLOOKUP('Ibilgailu-mota'!$E$10,DE!$D$1:$AX$286,17,0)=\"\",\"\",HLOOKUP('Ibilgailu-mota'!$E$10,DE!$D$1:$AX$286,17,0))","v":129466.55}]
[]
[null,null,"Bizitza teknikoa (urteak) ",null,null,null,null,null,null,null,null,{"$f":"IF(HLOOKUP('Ibilgailu-mota'!$E$10,DE!$D$1:$AX$286,18,0)=\"\",\"\",HLOOKUP('Ibilgailu-mota'!$E$10,DE!$D$1:$AX$286,18,0))","v":12}]
[]
{"$rows_left_out":44}
{"sheet":"Ibilgailuan doazen langileen ko","index":5,"n_rows":39,"n_cols":11,"rows_kept":39,"cut":false,"hidden":false,"merged":[]}
[]
[]
[]
[]
[]
[null,null,"3. Ibilgailuan doazen langileen kostuak "]
[]
[]
[null,null,"IBIGAILUAN DOAZEN LANGILEEN KOSTUAK ",null,null,null,null,null,null,"Datu estadistikoak",{"$f":"DE!$AJ$2","v":"19/06/2025"}]
[]
[null,null,"Ibilgailuan doazen langileen urteko kostuak, guztira, enpresa-kostuak barne (Gizarte Segurantza eta beste)(€)",null,null,null,null,null,null,{"$f":"IF(HLOOKUP('Ibilgailu-mota'!$E$10,DE!$D$1:$AK$285,35,0)=\"\",\"\",HLOOKUP('Ibilgailu-mota'!$E$10,DE!$D$1:$AK$285,35,0))","v":34931.949999999997}]
[]
[null,null,"Ibilgailuan doazen langileen beste ordainsari osagarri batzuk (€)",null,null,null,null,null,null,{"$f":"IF(HLOOKUP('Ibilgailu-mota'!$E$10,DE!$D$1:$AK$285,36,0)=\"\",\"\",HLOOKUP('Ibilgailu-mota'!$E$10,DE!$D$1:$AK$285,36,0))","v":0}]
[]
[null,null,"GARRAIO ERREGULARREKO ZERBITZUAK"]
[]
[null,null,"Garraio erregularreko ibilgailuan doazen langileen eguneko dieta osoa (€/egun) ",null,null,null,null,null,null,{"$f":"IF(HLOOKUP('Ibilgailu-mota'!$E$10,DE!$D$1:$AK$285,37,0)=\"\",\"\",HLOOKUP('Ibilgailu-mota'!$E$10,DE!$D$1:$AK$285,37,0))","v":31.82}]
[]
[null,null,"Dietarekin urtean emandako garraio erregularreko egunen kopurua ",null,null,null,null,null,null,{"$f":"IF(HLOOKUP('Ibilgailu-mota'!$E$10,DE!$D$1:$AK$285,38,0)=\"\",\"\",HLOOKUP('Ibilgailu-mota'!$E$10,DE!$D$1:$AK$285,38,0))","v":100}]
[]
{"$rows_left_out":20}
{"sheet":"Aseguruak esta zerga arloko kos","index":6,"n_rows":47,"n_cols":11,"rows_kept":47,"cut":false,"hidden":false,"merged":[]}
[]
[]
[]
[]
[]
[null,null,"4. Aseguruak esta zerga arloko kostuak"]
[]
[]
[null,null,"Aseguruak ",null,null,null,null,null,null,"Datu estadistikoak",{"$f":"DE!$AJ$2","v":"19/06/2025"}]
[]
[null,null,"Autobusaren nahitaezko asegurua (€)",null,null,null,null,null,null,{"$f":"IF(HLOOKUP('Ibilgailu-mota'!$E$10,DE!$D$1:$AK$285,48,0)=\"\",\"\",HLOOKUP('Ibilgailu-mota'!$E$10,DE!$D$1:$AK$285,48,0))","v":0}]
[]
[null,null,"Erantzukizun zibila (€)",null,null,null,null,null,null,{"$f":"IF(HLOOKUP('Ibilgailu-mota'!$E$10,DE!$D$1:$AK$285,49,0)=\"\",\"\",HLOOKUP('Ibilgailu-mota'!$E$10,DE!$D$1:$AK$285,49,0))","v":0}]
[]
[null,null,"Bidaiarien nahitaezko asegurua (€)",null,null,null,null,null,null,{"$f":"IF(HLOOKUP('Ibilgailu-mota'!$E$10,DE!$D$1:$AK$285,50,0)=\"\",\"\",HLOOKUP('Ibilgailu-mota'!$E$10,DE!$D$1:$AK$285,50,0))","v":0}]
[]
[null,null,"Gidariaren istripu-asegurua (€)",null,null,null,null,null,null,{"$f":"IF(HLOOKUP('Ibilgailu-mota'!$E$10,DE!$D$1:$AK$285,51,0)=\"\",\"\",HLOOKUP('Ibilgailu-mota'!$E$10,DE!$D$1:$AK$285,51,0))","v":0}]
[]
[null,null,"Defentsa eta kalteengatiko erreklamazioa (€)",null,null,null,null,null,null,{"$f":"IF(HLOOKUP('Ibilgailu-mota'!$E$10,DE!$D$1:$AK$285,52,0)=\"\",\"\",HLOOKUP('Ibilgailu-mota'!$E$10,DE!$D$1:$AK$285,52,0))","v":0}]
[]
{"$rows_left_out":28}
{"sheet":"Kostu aldakorrak","index":7,"n_rows":61,"n_cols":13,"rows_kept":61,"cut":false,"hidden":false,"merged":[]}
[]
[]
[]
[]
[]
[null,null,"5. Kostu aldakorrak "]
[]
[]
[null,null,"Erregaia ",null,null,null,null,null,null,null,null,"Datu estadistikoak",{"$f":"DE!$AJ$2","v":"19/06/2025"}]
[]
[null,null,"Erregaiaren prezioa BEZ barne (€/litroko) ",null,null,null,null,null,null,null,null,{"$f":"IF(HLOOKUP('Ibilgailu-mota'!$E$10,DE!$D$1:$AK$285,66,0)=\"\",\"\",HLOOKUP('Ibilgailu-mota'!$E$10,DE!$D$1:$AK$285,66,0))","v":1.234}]
[]
[null,null,"Deskontua (€/litroko)",null,null,null,null,null,null,null,null,{"$f":"IF(HLOOKUP('Ibilgailu-mota'!$E$10,DE!$D$1:$AK$285,67,0)=\"\",\"\",HLOOKUP('Ibilgailu-mota'!$E$10,DE!$D$1:$AK$285,67,0))","v":0.11600000000000001}]
[]
[null,null,"Erregaiari aplikatutako BEZa (€/litroKO)",null,null,null,null,null,"%",{"$f":"IFERROR(ROUND((H15/100)*(J11-J13)/(1+H15/100),4),0)","v":0},{"$f":"IF(HLOOKUP(CONCATENATE('Ibilgailu-mota'!$E$10,\"A\"),DE!$C$1:$AK$301,68,0)=\"\",\"\",HLOOKUP(CONCATENATE('Ibilgailu-mota'!$E$10,\"A\"),DE!$C$1:$AK$301,68,0))","v":21},{"$f":"IF(HLOOKUP('Ibilgailu-mota'!$E$10,DE!$D$1:$AK$285,68,0)=\"\",\"\",HLOOKUP('Ibilgailu-mota'!$E$10,DE!$D$1:$AK$285,68,0))","v":0.19400000000000001}]
[]
[null,null,"Erregaiaren prezioa, BEZ gabe (€/litro) ",null,null,null,null,null,null,{"$f":"IFERROR(ROUND((J11-J13)/(1+H15/100),4),0)","v":0},null,{"$f":"IF(HLOOKUP('Ibilgailu-mota'!$E$10,DE!$D$1:$AK$285,69,0)=\"\",\"\",HLOOKUP('Ibilgailu-mota'!$E$10,DE!$D$1:$AK$285,69,0))","v":0.92400000000000004}]
[]
[null,null,"URTEAN ERREGAITAN EGINDAKO GASTU OSOA, BEZ GABE (€)",null,null,null,null,null,null,{"$f":"IFERROR(ROUND(('Ibilgailuaren Ezaugarriak'!J23/100)*'Ibilgailuaren Ezaugarriak'!J27*'Kostu aldakorrak'!J17,0),0)","v":0},null,{"$f":"IF(HLOOKUP('Ibilgailu-mota'!$E$10,DE!$D$1:$AK$285,70,0)=\"\",\"\",HLOOKUP('Ibilgailu-mota'!$E$10,DE!$D$1:$AK$285,70,0))","v":20790}]
[]
{"$rows_left_out":42}
{"sheet":"Zeharkako kostuak","index":8,"n_rows":15,"n_cols":12,"rows_kept":15,"cut":false,"hidden":false,"merged":[]}
[]
[]
[]
[]
[]
[null,null,"6. Zeharkako kostuak "]
[]
[]
[null,null,"Zeharkako kostuak ",null,null,null,null,null,null,"Datu estadistikoak",{"$f":"DE!$AJ$2","v":"19/06/2025"}]
[]
[null,null,"% Kudeaketa-, administrazio- eta merkaturatze-kostu aldakorrak",null,null,null,null,null,"%",{"$f":"ROUND(('Erosketa kostuak'!J63+'Ibilgailuan doazen langileen ko'!H39+'Aseguruak esta zerga arloko kos'!H47+'Kostu aldakorrak'!J59)*('Zeharkako kostuak'!H11/100),0)","v":0},{"$f":"IF(HLOOKUP(CONCATENATE('Ibilgailu-mota'!$E$10,\"A\"),DE!$C$1:$AK$301,86,0)=\"\",\"\",HLOOKUP(CONCATENATE('Ibilgailu-mota'!$E$10,\"A\"),DE!$C$1:$AK$301,86,0))","v":12.5},{"$f":"IF(HLOOKUP('Ibilgailu-mota'!$E$10,DE!$D$1:$AK$285,86,0)=\"\",\"\",HLOOKUP('Ibilgailu-mota'!$E$10,DE!$D$1:$AK$285,86,0))","v":13651}]
[]
[null,null,"ZEHARKAKO GASTUAK  (€)",null,null,null,null,{"$f":"J11","v":0},null,{"$f":"IF(HLOOKUP('Ibilgailu-mota'!$E$10,DE!$D$1:$AK$285,87,0)=\"\",\"\",HLOOKUP('Ibilgailu-mota'!$E$10,DE!$D$1:$AK$285,87,0))","v":13651}]
[]
[null,null,"KOSTU GUZTIAK (€)",null,null,null,null,{"$f":"IFERROR(ROUND(H13+'Kostu aldakorrak'!J61,0),0)","v":0},null,{"$f":"IF(HLOOKUP('Ibilgailu-mota'!$E$10,DE!$D$1:$AK$285,88,0)=\"\",\"\",HLOOKUP('Ibilgailu-mota'!$E$10,DE!$D$1:$AK$285,88,0))","v":122858}]

{"sheet":"Emaitzak","index":9,"n_rows":101,"n_cols":16,"rows_kept":101,"cut":false,"hidden":false,"merged":[[8,4,8,5],[90,4,90,5],[40,4,40,5],[67,4,67,5]]}
[]
[]
[]
[]
[]
[null,null,"Emaitzak"]
[]
[]
[null,null,"URTEKO KOSTUEN EMAITZAK ",null,"Erabiltzailea",null,null,"Datu estadistikoak",{"$f":"DE!$AJ$2","v":"19/06/2025"}]
[null,null,null,null,"Euro","%",null,"Euro","%"]
[null,null,"KOSTU GUZTIAK",null,{"$f":"ROUND(E12+E21,0)","v":0},100,null,{"$f":"ROUND(H12+H21,0)","v":122857},100]
[null,null,"KOSTUAK DENBORAREN ARABERA ",null,{"$f":"ROUND(IFERROR(SUM(E13:E20),0),0)","v":0},{"$f":"IFERROR(E12*F11/E11,0)","v":0},null,{"$f":"ROUND(IFERROR(SUM(H13:H20),0),0)","v":82670},{"$f":"IFERROR(H12*I11/H11,0)","v":67.28961312745713}]
[null,null,"Leasinga ","A",{"$f":"ROUND('Erosketa kostuak'!J13+'Erosketa kostuak'!J31+'Erosketa kostuak'!J49,0)","v":0},{"$f":"IFERROR(E13*F$11/E$11,0)","v":0},"A",{"$f":"ROUND('Erosketa kostuak'!L13+'Erosketa kostuak'!L31+'Erosketa kostuak'!L49,0)","v":0},{"$f":"IFERROR(H13*I$11/H$11,0)","v":0},null,"A",{"$f":"E13","v":0},0,"A",{"$f":"H13","v":0},0]
[null,null,"Amortización ","B",{"$f":"ROUND('Erosketa kostuak'!J23+'Erosketa kostuak'!J41+'Erosketa kostuak'!J59,0)","v":0},0,"B",{"$f":"ROUND('Erosketa kostuak'!L23+'Erosketa kostuak'!L41+'Erosketa kostuak'!L59,0)","v":16754},13.636992601154187,null,"B",0,0,"B",16754,13.636992601154187]
[null,null,"Finantza-gastuak ","C",{"$f":"ROUND('Erosketa kostuak'!J25+'Erosketa kostuak'!J43+'Erosketa kostuak'!J61,0)","v":0},0,"C",{"$f":"ROUND('Erosketa kostuak'!L25+'Erosketa kostuak'!L43+'Erosketa kostuak'!L61,0)","v":6716},5.4665179843232377,null,"C",0,0,"C",6716,5.4665179843232377]
[null,null,"Gidariaren urteko kostua guztira ","D",{"$f":"ROUND('Ibilgailuan doazen langileen ko'!H11,0)","v":0},0,"D",{"$f":"ROUND('Ibilgailuan doazen langileen ko'!J11,0)","v":34932},28.433056317507347,null,"D",0,0,"D",34932,28.433056317507347]
[null,null,"Dietak guztira eta jarduera-plusa ","E",{"$f":"ROUND('Ibilgailuan doazen langileen ko'!H13+'Ibilgailuan doazen langileen ko'!H25+'Ibilgailuan doazen langileen ko'!H37,0)","v":0},0,"E",{"$f":"ROUND('Ibilgailuan doazen langileen ko'!J13+'Ibilgailuan doazen langileen ko'!J25+'Ibilgailuan doazen langileen ko'!J37,0)","v":6364},5.180006023262818,null,"E",0,0,"E",6364,5.180006023262818]
[null,null,"Aseguruak ","F",{"$f":"ROUND('Aseguruak esta zerga arloko kos'!H27,0)","v":0},0,"F",{"$f":"ROUND('Aseguruak esta zerga arloko kos'!J27,0)","v":3059},2.4898866161472282,null,"F",0,0,"F",3059,2.4898866161472282]
[null,null,"Zerga-arloko kostuak ","G",{"$f":"ROUND('Aseguruak esta zerga arloko kos'!H45,0)","v":0},0,"G",{"$f":"ROUND('Aseguruak esta zerga arloko kos'!J45,0)","v":1194},0.97186159518790138,null,"G",0,0,"G",1194,0.97186159518790138]
[null,null,"Kudeaketa eta merkaturatzea ","H",{"$f":"ROUND('Zeharkako kostuak'!H13,0)","v":0},0,"H",{"$f":"ROUND('Zeharkako kostuak'!J13,0)","v":13651},11.111291989874406,null,"H",0,0,"H",13651,11.111291989874406]
{"$rows_left_out":82}
{"sheet":"Zerbitzuaren kostua","index":10,"n_rows":33,"n_cols":8,"rows_kept":33,"cut":false,"hidden":false,"merged":[[10,7,10,10]]}
[]
[]
[]
[]
[]
[null,null,"Zerbitzuaren kostua"]
[]
[]
[null,null,"ZERBITZUAREN KOSTUA "]
[]
[null,null,"Zerbitzuaren izena "]
[]
[null,null,"Zerbitzu honetan egindako kilometroak "]
[]
[null,null,"Kilometroak bidaiariko (km) "]
[]
[null,null,"Zerbitzu honetan batez besteko kontsumoa kilometroko (litro / 100 km-ko) "]
[]
[null,null,"Zerbitzu honetan bidaiariek batez beste okupatutako plaza kopurua "]
[]
{"$rows_left_out":13}