{"text_format":"1","workbook":"xlsx","n_sheets":11,"sheets":["T","DE","Tipo Vehículo","Características Vehículo","Costes Adquisición","Costes Personal","Seguros y Costes Fiscales","Costes Variables","Costes Indirectos","Resultados","Coste Servicio"],"not_rendered":{"charts":6,"images":5,"macros":1,"external_links":0,"defined_names":3,"comments":1,"pivot_tables":0},"unopened":[],"bounds":{"document_bytes":16777216,"sheet_cells":100000,"rows_first":2000,"rows_last":500,"rows_between":2000,"halvings":0,"cell_chars":16384,"cell_head_chars":4096},"cells_cut":0,"cells_raw":0,"read":"whole","date_system":"1900"}

{"sheet":"T","index":0,"n_rows":6,"n_cols":8,"rows_kept":6,"cut":false,"hidden":true,"merged":[]}
["Tipo de vehículo",null,"Pregunta",null,null,"Adquisicion",null,"Editar"]
["Autocar de 15 metros","T17","Si","S",null,"COMPRA"]
["Autocar de 12 metros","T18","No","N",null,"ALQUILER, LEASING…"]
["Autocar de 9 metros","T19"]
["Microbús","T20"]
["Autocar genérico (autocares no englobados en las categorías anteriores)","T21"]

{"sheet":"DE","index":1,"n_rows":90,"n_cols":36,"rows_kept":90,"cut":false,"hidden":true,"merged":[[16,13,16,14],[36,13,36,14]]}
[null,null,"T17A","T17","T18A","T18","T19A","T19","T20A","T20","T21A","T21"]
[null,"Descripción:"," ","Autocar de 15 metros"," ","Autocar de 12 metros"," ","Autocar de 9 metros"," ","Microbús"," ","Autocar genérico (autocares no englobados en las categorías anteriores)",null,null,null,null,null,null,null,null,null,null,null,null,null,null,null,null,null,null,null,null,null,null,null,"03/07/2025"]
[null,"Tipo interes",null,0.0453,null,0.0453,null,0.0453,null,0.0453,null,0.0453]
[null,"Número de plazas incluido el conductor",null,65.0,null,55.0,null,35.0,null,25.0,null,55.0]
[null,"Potencia (CV)",null,420.0,null,380.0,null,280.0,null,160.0,null,380.0]
[null,"Masa Máxima Autorizada (kg)",null,0.0,null,0.0,null,0.0,null,0.0,null,0.0]
[null,"Número de ejes",null,3.0,null,2.0,null,2.0,null,2.0,null,2.0]
[null,"Kilómetros recorridos anualmente",null,75000.0,null,65000.0,null,50000.0,null,40000.0,null,65000.0]
[null,"Kilómetros facturados de los recorridos al año (km)",95.0,{"$f":"ROUND(D8*C9/100,2)","v":71250.0},95.0,{"$f":"F8*E9/100","v":61750.0},95.0,{"$f":"H8*G9/100","v":47500.0},95.0,{"$f":"J8*I9/100","v":38000.0},95.0,{"$f":"L8*K9/100","v":61750.0}]
[null,"Consumo medio (litros/100km)",null,30.0,null,26.0,null,21.0,null,15.5,null,26.0]
[null,"Horas trabajadas al año",null,1800.0,null,1800.0,null,1800.0,null,1800.0,null,1800.0]
[null,"Horas facturadas de las trabajadas al año (h,%)",91.0,{"$f":"ROUND(D11*C12/100,0)","v":1638.0},91.0,{"$f":"F11*E12/100","v":1638.0},91.0,{"$f":"H11*G12/100","v":1638.0},91.0,{"$f":"J11*I12/100","v":1638.0},91.0,{"$f":"L11*K12/100","v":1638.0}]
[null,"Kilómetros con viajeros de los recorridos al año (km,%)",90.0,{"$f":"ROUND(D8*C13/100,2)","v":67500.0},90.0,{"$f":"F8*E13/100","v":58500.0},90.0,{"$f":"H8*G13/100","v":45000.0},90.0,{"$f":"J8*I13/100","v":36000.0},90.0,{"$f":"L8*K13/100","v":58500.0}]
[null,"Ocupación media de las plazas en los kilómetros recorridos con viajeros (viajeros/autocar,%)",80.0,{"$f":"ROUND((D4-1)*C14/100,0)","v":51.0},80.0,{"$f":"ROUND((F4-1)*E14/100,0)","v":43.0},80.0,{"$f":"ROUND((H4-1)*G14/100,0)","v":27.0},80.0,{"$f":"ROUND((J4-1)*I14/100,0)","v":19.0},80.0,{"$f":"ROUND((L4-1)*K14/100,0)","v":43.0}]
[null,"Producción anual: Viajeros x Kilómetros",null,{"$f":"D13*D14","v":3442500.0},null,{"$f":"F13*F14","v":2515500.0},null,{"$f":"H13*H14","v":1215000.0},null,{"$f":"J13*J14","v":684000.0},null,{"$f":"L13*L14","v":2515500.0}]
[null,"Pago de alquiler o leasing anual (€)",null,0.0,null,0.0,null,0.0,null,0.0,null,0.0,"CHASIS"]
[null,"Precio de adquisición (precio de tarifa - descuento) sin IVA (€)",null,131408.55,null,116029.69,null,78861.75,null,40274.0,null,116029.69]
[null,"Vida útil (años)",null,12.0,null,12.0,null,12.0,null,12.0,null,12.0]
[null,"Valor residual sin IVA (€)",20.0,{"$f":"ROUND(D17*C19/100,0)","v":26282.0},20.0,{"$f":"ROUND(F17*E19/100,0)","v":23206.0},20.0,{"$f":"ROUND(H17*G19/100,0)","v":15772.0},20.0,{"$f":"ROUND(J17*I19/100,0)","v":8055.0},20.0,{"$f":"ROUND(L17*K19/100,0)","v":23206.0}]
[null,"AMORTIZACION DEL CHASIS",null,{"$f":"IFERROR(ROUND((D17-D19-D80)/D18,0),0)","v":8246.0},null,{"$f":"IFERROR(ROUND((F17-F19-F80)/F18,0),0)","v":7451.0},null,{"$f":"IFERROR(ROUND((H17-H19-H80)/H18,0),0)","v":5069.0},null,{"$f":"IFERROR(ROUND((J17-J19-J80)/J18,0),0)","v":2562.0},null,{"$f":"IFERROR(ROUND((L17-L19-L80)/L18,0),0)","v":7451.0}]
{"$rows_left_out":71}
{"sheet":"Tipo Vehículo","index":2,"n_rows":16,"n_cols":7,"rows_kept":16,"cut":false,"hidden":false,"merged":[]}
[]
[]
[]
[]
[]
[null,null,"1. Seleccionar tipo de vehículo"]
[]
[]
[]
[null,null,"Tipo de vehículo:",null,{"$f":"VLOOKUP(F10,T!A2:B17,2,0)","v":"T17"},"Autocar de 15 metros"]
[]
[]
[null,null,"¿Desea cargar los datos estadísticos en los campos a rellenar?",null,null,null,"No"]
[]
[]
[null,null,"¿Desea comenzar la simulación con los datos estadísticos añadidos a los formularios de cálculo?"]

{"sheet":"Características Vehículo","index":3,"n_rows":39,"n_cols":13,"rows_kept":39,"cut":false,"hidden":false,"merged":[[10,9,10,13]]}
[]
[]
[]
[]
[]
[null,null,"1. Características del vehículo"]
[]
[]
[null,null,"Características técnicas del vehículo",null,null,null,null,null,null,null,null,"Datos estadísticos",{"$f":"DE!$AJ$2","v":"19/06/2025"}]
[]
[null,null,"Descripción:",null,null,null,null,null,null,{"$f":"IF(HLOOKUP('Tipo Vehículo'!$E$10,DE!$C$1:$AK$15,2,0)=\"\",\"\",HLOOKUP('Tipo Vehículo'!$E$10,DE!$C$1:$AK$15,2,0))","v":"Autocar de 15 metros"}]
[]
[null,null,"Número de plazas incluido el conductor",null,null,null,null,null,null,null,null,{"$f":"IF(HLOOKUP('Tipo Vehículo'!$E$10,DE!$C$1:$X$15,4,0)=\"\",\"\",HLOOKUP('Tipo Vehículo'!$E$10,DE!$C$1:$X$15,4,0))","v":15}]
[]
[null,null,"Potencia (CV)",null,null,null,null,null,null,null,null,{"$f":"IF(HLOOKUP('Tipo Vehículo'!$E$10,DE!$C$1:$X$15,5,0)=\"\",\"\",HLOOKUP('Tipo Vehículo'!$E$10,DE!$C$1:$X$15,5,0))","v":15}]
[]
[null,null,"MMA ( Tm)",null,null,null,null,null,null,null,null,{"$f":"IF(HLOOKUP('Tipo Vehículo'!$E$10,DE!$C$1:$X$15,6,0)=\"\",\"\",HLOOKUP('Tipo Vehículo'!$E$10,DE!$C$1:$X$15,6,0))","v":0}]
[]
[null,null,"Número de ejes",null,null,null,null,null,null,null,null,{"$f":"IF(HLOOKUP('Tipo Vehículo'!$E$10,DE!$C$1:$X$15,7,0)=\"\",\"\",HLOOKUP('Tipo Vehículo'!$E$10,DE!$C$1:$X$15,7,0))","v":4}]
[]
{"$rows_left_out":20}
{"sheet":"Costes Adquisición","index":4,"n_rows":63,"n_cols":13,"rows_kept":63,"cut":false,"hidden":false,"merged":[[10,9,10,10],[28,9,28,10],[46,9,46,10]]}
[]
[]
[]
[]
[]
[null,null,"2. Costes de adquisición"]
[]
[]
[null,null,"Chasis del autocar",null,null,null,null,null,null,null,null,"Datos estadísticos",{"$f":"DE!$AJ$2","v":"19/06/2025"}]
[null,null,null,null,null,null,null,null,null,null,null,{"$f":"IF(HLOOKUP('Tipo Vehículo'!$E$10,DE!$C$1:$AK$286,3,0)=\"\",\"\",HLOOKUP('Tipo Vehículo'!$E$10,DE!$C$1:$AK$286,3,0))","v":5.6099999999999997E-2}]
[null,null,"Forma de adquisición: ",null,null,null,null,null,null,"COMPRA"]
[]
[null,null,"Pago de alquiler o leasing anual (€)",null,null,null,null,null,null,null,null,{"$f":"IF(HLOOKUP('Tipo Vehículo'!$E$10,DE!$C$1:$AK$286,16,0)=\"\",\"\",HLOOKUP('Tipo Vehículo'!$E$10,DE!$C$1:$AK$286,16,0))","v":0}]
[]
[null,null,"Compra del chasis (€)"]
[]
[null,null,"Precio de adquisición (precio de tarifa - descuento) sin IVA (€)",null,null,null,null,null,null,null,null,{"$f":"IF(HLOOKUP('Tipo Vehículo'!$E$10,DE!$C$1:$AK$286,17,0)=\"\",\"\",HLOOKUP('Tipo Vehículo'!$E$10,DE!$C$1:$AK$286,17,0))","v":129466.55}]
[]
[null,null,"Vida útil (años)",null,null,null,null,null,null,null,null,{"$f":"IF(HLOOKUP('Tipo Vehículo'!$E$10,DE!$C$1:$AK$286,18,0)=\"\",\"\",HLOOKUP('Tipo Vehículo'!$E$10,DE!$C$1:$AK$286,18,0))","v":12}]
[]
{"$rows_left_out":44}
{"sheet":"Costes Personal","index":5,"n_rows":39,"n_cols":11,"rows_kept":39,"cut":false,"hidden":false,"merged":[]}
[]
[]
[]
[]
[]
[null,null,"3. Costes de personal de a bordo"]
[]
[]
[null,null,"COSTES DE PERSONAL DE A BORDO",null,null,null,null,null,null,"Datos estadísticos",{"$f":"DE!$AJ$2","v":"19/06/2025"}]
[]
[null,null,"Coste total anual del personal de a bordo, incluidos costes de empresa (Seguridad Social y otros) (€)",null,null,null,null,null,null,{"$f":"IF(HLOOKUP('Tipo Vehículo'!$E$10,DE!$C$1:$X$285,35,0)=\"\",\"\",HLOOKUP('Tipo Vehículo'!$E$10,DE!$C$1:$X$285,35,0))","v":34931.949999999997}]
[]
[null,null,"Otros complementos retributivos del personal de a bordo (€)",null,null,null,null,null,null,{"$f":"IF(HLOOKUP('Tipo Vehículo'!$E$10,DE!$C$1:$X$285,36,0)=\"\",\"\",HLOOKUP('Tipo Vehículo'!$E$10,DE!$C$1:$X$285,36,0))","v":0}]
[]
[null,null,"SERVICIOS DE TRANSPORTE REGULARES"]
[]
[null,null,"Dieta total diaria del personal de a bordo de transporte regular (€/día)",null,null,null,null,null,null,{"$f":"IF(HLOOKUP('Tipo Vehículo'!$E$10,DE!$C$1:$X$285,37,0)=\"\",\"\",HLOOKUP('Tipo Vehículo'!$E$10,DE!$C$1:$X$285,37,0))","v":31.82}]
[]
[null,null,"Número de días de transporte regular con dieta al año",null,null,null,null,null,null,{"$f":"IF(HLOOKUP('Tipo Vehículo'!$E$10,DE!$C$1:$X$285,38,0)=\"\",\"\",HLOOKUP('Tipo Vehículo'!$E$10,DE!$C$1:$X$285,38,0))","v":100}]
[]
{"$rows_left_out":20}
{"sheet":"Seguros y Costes Fiscales","index":6,"n_rows":47,"n_cols":11,"rows_kept":47,"cut":false,"hidden":false,"merged":[]}
[]
[]
[]
[]
[]
[null,null,"4. Seguros y costes fiscales"]
[]
[]
[null,null,"SEGUROS",null,null,null,null,null,null,"Datos estadísticos",{"$f":"DE!$AJ$2","v":"19/06/2025"}]
[]
[null,null,"Seguro obligatorio del autocar (€)",null,null,null,null,null,null,{"$f":"IF(HLOOKUP('Tipo Vehículo'!$E$10,DE!$C$1:$X$285,48,0)=\"\",\"\",HLOOKUP('Tipo Vehículo'!$E$10,DE!$C$1:$X$285,48,0))","v":0}]
[]
[null,null,"Responsabilidad civil (€)",null,null,null,null,null,null,{"$f":"IF(HLOOKUP('Tipo Vehículo'!$E$10,DE!$C$1:$X$285,49,0)=\"\",\"\",HLOOKUP('Tipo Vehículo'!$E$10,DE!$C$1:$X$285,49,0))","v":0}]
[]
[null,null,"Seguro obligatorio de personas (€)",null,null,null,null,null,null,{"$f":"IF(HLOOKUP('Tipo Vehículo'!$E$10,DE!$C$1:$X$285,50,0)=\"\",\"\",HLOOKUP('Tipo Vehículo'!$E$10,DE!$C$1:$X$285,50,0))","v":0}]
[]
[null,null,"Seguro de accidentes del conductor (€)",null,null,null,null,null,null,{"$f":"IF(HLOOKUP('Tipo Vehículo'!$E$10,DE!$C$1:$X$285,51,0)=\"\",\"\",HLOOKUP('Tipo Vehículo'!$E$10,DE!$C$1:$X$285,51,0))","v":0}]
[]
[null,null,"Defensa y reclamación de daños (€)",null,null,null,null,null,null,{"$f":"IF(HLOOKUP('Tipo Vehículo'!$E$10,DE!$C$1:$X$285,52,0)=\"\",\"\",HLOOKUP('Tipo Vehículo'!$E$10,DE!$C$1:$X$285,52,0))","v":0}]
[]
{"$rows_left_out":28}
{"sheet":"Costes Variables","index":7,"n_rows":61,"n_cols":13,"rows_kept":61,"cut":false,"hidden":false,"merged":[]}
[]
[]
[]
[]
[]
[null,null,"5. Costes variables"]
[]
[]
[null,null,"Carburante",null,null,null,null,null,null,null,null,"Datos estadísticos",{"$f":"DE!$AJ$2","v":"19/06/2025"}]
[]
[null,null,"Precio del carburante, con IVA (€/litro)",null,null,null,null,null,null,null,null,{"$f":"IF(HLOOKUP('Tipo Vehículo'!$E$10,DE!$C$1:$X$285,66,0)=\"\",\"\",HLOOKUP('Tipo Vehículo'!$E$10,DE!$C$1:$X$285,66,0))","v":1.234}]
[]
[null,null,"Descuento (€/litro)",null,null,null,null,null,null,null,null,{"$f":"IF(HLOOKUP('Tipo Vehículo'!$E$10,DE!$C$1:$X$285,67,0)=\"\",\"\",HLOOKUP('Tipo Vehículo'!$E$10,DE!$C$1:$X$285,67,0))","v":0.11600000000000001}]
[]
[null,null,"IVA aplicado al carburante (€/litro)",null,null,null,null,null,"%",{"$f":"IFERROR(ROUND((H15/100)*(J11-J13)/(1+H15/100),4),0)","v":0},{"$f":"IF(HLOOKUP(CONCATENATE('Tipo Vehículo'!$E$10,\"A\"),DE!$C$1:$X$301,68,0)=\"\",\"\",HLOOKUP(CONCATENATE('Tipo Vehículo'!$E$10,\"A\"),DE!$C$1:$X$301,68,0))","v":21},{"$f":"IF(HLOOKUP('Tipo Vehículo'!$E$10,DE!$C$1:$X$285,68,0)=\"\",\"\",HLOOKUP('Tipo Vehículo'!$E$10,DE!$C$1:$X$285,68,0))","v":0.19400000000000001}]
[]
[null,null,"Precio carburante sin IVA (€/litro)",null,null,null,null,null,null,{"$f":"IFERROR(ROUND((J11-J13)/(1+H15/100),4),0)","v":0},null,{"$f":"IF(HLOOKUP('Tipo Vehículo'!$E$10,DE!$C$1:$X$285,69,0)=\"\",\"\",HLOOKUP('Tipo Vehículo'!$E$10,DE!$C$1:$X$285,69,0))","v":0.92400000000000004}]
[]
[null,null,"GASTO TOTAL ANUAL EN CARBURANTE, SIN IVA (€)",null,null,null,null,null,null,{"$f":"IFERROR(ROUND(('Características Vehículo'!J23/100)*'Características Vehículo'!J27*'Costes Variables'!J17,0),0)","v":0},null,{"$f":"IF(HLOOKUP('Tipo Vehículo'!$E$10,DE!$C$1:$X$285,70,0)=\"\",\"\",HLOOKUP('Tipo Vehículo'!$E$10,DE!$C$1:$X$285,70,0))","v":20790}]
[]
{"$rows_left_out":42}
{"sheet":"Costes Indirectos","index":8,"n_rows":15,"n_cols":12,"rows_kept":15,"cut":false,"hidden":false,"merged":[]}
[]
[]
[]
[]
[]
[null,null,"6. Costes indirectos"]
[]
[]
[null,null,"Costes Indirectos",null,null,null,null,null,null,"Datos estadísticos",{"$f":"DE!$AJ$2","v":"19/06/2025"}]
[]
[null,null,"% Costes variables de gestión, administración y comercialización",null,null,null,null,null,"%",{"$f":"ROUND(('Costes Adquisición'!J63+'Costes Personal'!H39+'Seguros y Costes Fiscales'!H47+'Costes Variables'!J59)*(H11/100),0)","v":0},{"$f":"IF(HLOOKUP(CONCATENATE('Tipo Vehículo'!$E$10,\"A\"),DE!$C$1:$X$301,86,0)=\"\",\"\",HLOOKUP(CONCATENATE('Tipo Vehículo'!$E$10,\"A\"),DE!$C$1:$X$301,86,0))","v":12.5},{"$f":"IF(HLOOKUP('Tipo Vehículo'!$E$10,DE!$C$1:$X$285,86,0)=\"\",\"\",HLOOKUP('Tipo Vehículo'!$E$10,DE!$C$1:$X$285,86,0))","v":13651}]
[]
[null,null,"COSTES INDIRECTOS (€)",null,null,null,null,{"$f":"J11","v":0},null,{"$f":"IF(HLOOKUP('Tipo Vehículo'!$E$10,DE!$C$1:$X$285,87,0)=\"\",\"\",HLOOKUP('Tipo Vehículo'!$E$10,DE!$C$1:$X$285,87,0))","v":13651}]
[]
[null,null,"COSTES TOTALES (€)",null,null,null,null,{"$f":"IFERROR(ROUND(H13+'Costes Variables'!J61,0),0)","v":0},null,{"$f":"IF(HLOOKUP('Tipo Vehículo'!$E$10,DE!$C$1:$X$285,88,0)=\"\",\"\",HLOOKUP('Tipo Vehículo'!$E$10,DE!$C$1:$X$285,88,0))","v":122858}]

{"sheet":"Resultados","index":9,"n_rows":101,"n_cols":16,"rows_kept":101,"cut":false,"hidden":false,"merged":[[8,4,8,5],[90,4,90,5],[40,4,40,5],[67,4,67,5]]}
[]
[]
[]
[]
[]
[null,null,"Resultados"]
[]
[]
[null,null,"RESULTADOS COSTES ANUALES",null,"Usuario",null,null,"Datos estadísticos",{"$f":"DE!$AJ$2","v":"19/06/2025"}]
[null,null,null,null,"Euros","%",null,"Euros","%"]
[null,null,"COSTES TOTALES",null,{"$f":"ROUND(E12+E21,0)","v":0},100,null,{"$f":"ROUND(H12+H21,0)","v":122857},100]
[null,null,"COSTES POR TIEMPO",null,{"$f":"ROUND(IFERROR(SUM(E13:E20),0),0)","v":0},{"$f":"IFERROR(E12*F11/E11,0)","v":0},null,{"$f":"ROUND(IFERROR(SUM(H13:H20),0),0)","v":82670},{"$f":"IFERROR(H12*I11/H11,0)","v":67.28961312745713}]
[null,null,"Leasing","A",{"$f":"ROUND('Costes Adquisición'!J13+'Costes Adquisición'!J31+'Costes Adquisición'!J49,0)","v":0},{"$f":"IFERROR(E13*F$11/E$11,0)","v":0},"A",{"$f":"ROUND('Costes Adquisición'!L13+'Costes Adquisición'!L31+'Costes Adquisición'!L49,0)","v":0},{"$f":"IFERROR(H13*I$11/H$11,0)","v":0},null,"A",{"$f":"E13","v":0},0,"A",{"$f":"H13","v":0},0]
[null,null,"Amortización","B",{"$f":"ROUND('Costes Adquisición'!J23+'Costes Adquisición'!J41+'Costes Adquisición'!J59,0)","v":0},{"$f":"IFERROR(E14*F$11/E$11,0)","v":0},"B",{"$f":"ROUND('Costes Adquisición'!L23+'Costes Adquisición'!L41+'Costes Adquisición'!L59,0)","v":16754},13.636992601154187,null,"B",0,0,"B",16754,13.636992601154187]
[null,null,"Gastos financieros","C",{"$f":"ROUND('Costes Adquisición'!J25+'Costes Adquisición'!J43+'Costes Adquisición'!J61,0)","v":0},0,"C",{"$f":"ROUND('Costes Adquisición'!L25+'Costes Adquisición'!L43+'Costes Adquisición'!L61,0)","v":6716},5.4665179843232377,null,"C",0,0,"C",6716,5.4665179843232377]
[null,null,"Coste total anual del conductor","D",{"$f":"ROUND('Costes Personal'!H11,0)","v":0},0,"D",{"$f":"ROUND('Costes Personal'!J11,0)","v":34932},28.433056317507347,null,"D",0,0,"D",34932,28.433056317507347]
[null,null,"Dietas y otros complementos retributivos del personal de a bordo","E",{"$f":"ROUND('Costes Personal'!H13+'Costes Personal'!H25+'Costes Personal'!H37,0)","v":0},0,"E",{"$f":"ROUND('Costes Personal'!J13+'Costes Personal'!J25+'Costes Personal'!J37,0)","v":6364},5.180006023262818,null,"E",0,0,"E",6364,5.180006023262818]
[null,null,"Seguros","F",{"$f":"ROUND('Seguros y Costes Fiscales'!H27,0)","v":0},0,"F",{"$f":"ROUND('Seguros y Costes Fiscales'!J27,0)","v":3059},2.4898866161472282,null,"F",0,0,"F",3059,2.4898866161472282]
[null,null,"Costes fiscales","G",{"$f":"ROUND('Seguros y Costes Fiscales'!H45,0)","v":0},0,"G",{"$f":"ROUND('Seguros y Costes Fiscales'!J45,0)","v":1194},0.97186159518790138,null,"G",0,0,"G",1194,0.97186159518790138]
[null,null,"Gestión y comercialización","H",{"$f":"ROUND('Costes Indirectos'!H13,0)","v":0},0,"H",{"$f":"ROUND('Costes Indirectos'!J13,0)","v":13651},11.111291989874406,null,"H",0,0,"H",13651,11.111291989874406]
{"$rows_left_out":82}
{"sheet":"Coste Servicio","index":10,"n_rows":33,"n_cols":8,"rows_kept":33,"cut":false,"hidden":false,"merged":[[10,7,10,10]]}
[]
[]
[]
[]
[]
[null,null,"Coste de un servicio"]
[]
[]
[null,null,"Coste de un servicio"]
[]
[null,null,"Denominación del servicio"]
[]
[null,null,"Kilómetros recorridos en este servicio (km)"]
[]
[null,null,"Kilómetros con personas (km)"]
[]
[null,null,"Consumo medio por kilómetro en este servicio (litros / 100 km)"]
[]
[null,null,"Número medio de plazas de personas ocupadas en este servicio"]
[]
{"$rows_left_out":13}