{"text_format":"1","workbook":"xlsx","n_sheets":11,"sheets":["T","DE","Ibilgailu-mota","Ibilgailuaren Ezaugarriak","Erosketa kostuak","Pertsonal-kostuak","Aseguruak eta zerga arloko kost","Kostu aldakorrak","Zeharkako kostuak ","Emaitzak","Zerbitzuaren kostua"],"not_rendered":{"charts":6,"images":6,"macros":1,"external_links":1,"defined_names":5,"comments":1,"pivot_tables":0},"unopened":[],"bounds":{"document_bytes":16777216,"sheet_cells":100000,"rows_first":2000,"rows_last":500,"rows_between":2000,"halvings":0,"cell_chars":16384,"cell_head_chars":4096},"cells_cut":0,"cells_raw":0,"read":"whole","date_system":"1900"}

{"sheet":"T","index":0,"n_rows":17,"n_cols":8,"rows_kept":17,"cut":false,"hidden":true,"merged":[]}
["Tipo de vehículo",null,"Pregunta",null,null,"Adquisicion",null,"Editar"]
["Ibilbide luzeko zama arrunteko ibilgailu artikulatua","T1","Bai","S",null," EROSKETA"]
["Ibilbide laburreko zama arrunteko ibilgailu artikulatua","T2","Ez","N",null," ALOKAIRUA, LEASING..."]
["Edukiontziak eramateko ibilbide luzeko ibilgailua","T3"]
["Edukiontziak eramateko ibilbide laburreko ibilgailua","T4"]
["Obrako brozel artikulatua","T5"]
["Zama orokorreko ardatz 2ko ibilgailua","T6"]
["Ibilbide luzeko salgai arriskutsuen (kimikoak) ibilgailu artikulatua","T7"]
["Petrolioaren deribatuen (gasolio, gasolina, fuel-olioa) ibilgailu artikulatua","T8"]
["Ibilbide luzeko salgai arriskutsuen (gasak) patin-ibilgailua","T9"]
["Ibilgailu hozkailu artikulatua","T10"]
["Ardatz 2ko ibilgailu hozkailua","T11"]
["Ibilbide luzeko solteko gaien brozela","T12"]
["Ibilbide laburreko solteko gaien brozela","T13"]
["3T-ko banaketa-kamioi arina","T14"]
["Furgonetak","T15"]
["Ibilgailu arrunta (aurreko kategorietan sartzen ez diren gainerako ibilgailu guztiak)","T16"]

{"sheet":"DE","index":1,"n_rows":124,"n_cols":36,"rows_kept":124,"cut":false,"hidden":true,"merged":[]}
[null,null,null,"T1A","T1","T2A","T2","T3A","T3","T4A","T4","T5A","T5","T6A","T6","T7A","T7","T8A","T8","T9A","T9","T10A","T10","T11A","T11","T12A","T12","T13A","T13","T14A","T14","T15A","T15","T16A","T16"]
[null,"Descripción:",null," ","Ibilbide luzeko zama arrunteko ibilgailu artikulatua"," ","Ibilbide laburreko zama arrunteko ibilgailu artikulatua"," ","Edukiontziak eramateko ibilbide luzeko ibilgailua"," ","Edukiontziak eramateko ibilbide laburreko ibilgailua"," ","Obrako brozel artikulatua"," ","Zama orokorreko ardatz 2ko ibilgailua"," ","Ibilbide luzeko salgai arriskutsuen (kimikoak) ibilgailu artikulatua"," ","Petrolioaren deribatuen (gasolio, gasolina, fuel-olioa) ibilgailu artikulatua"," ","Ibilbide luzeko salgai arriskutsuen (gasak) patin-ibilgailua"," ","Ibilgailu hozkailu artikulatua"," ","Ardatz 2ko ibilgailu hozkailua"," ","Ibilbide luzeko solteko gaien brozela"," ","Ibilbide laburreko solteko gaien brozela"," ","3T-ko banaketa-kamioi arina"," ","Furgonetak"," ","Ibilgailu arrunta (aurreko kategorietan sartzen ez diren gainerako ibilgailu guztiak)","07/04/2026"]
[null,"Tipo interes",null,null,0.0425,null,0.0425,null,0.0425,null,0.0425,null,0.0425,null,0.0425,null,0.0425,null,0.0425,null,0.0425,null,0.0425,null,0.0425,null,0.0425,null,0.0425,null,0.0425,null,0.0425,null,0.0425]
[null,"Potencia",null,null,455.0,null,455.0,null,455.0,null,455.0,null,455.0,null,280.0,null,455.0,null,455.0,null,455.0,null,455.0,null,280.0,null,455.0,null,455.0,null,130.0,null,130.0,null,455.0]
[null,"MMA",null,null,40000.0,null,40000.0,null,44000.0,null,44000.0,null,40000.0,null,18000.0,null,40000.0,null,40000.0,null,40000.0,null,40000.0,null,18000.0,null,40000.0,null,40000.0,null,35000.0,null,3500.0,null,40000.0]
[null,"Carga útil",null,null,25000.0,null,25000.0,null,26250.0,null,26250.0,null,23000.0,null,9500.0,null,0.0,null,0.0,null,0.0,null,24000.0,null,9000.0,null,24000.0,null,24000.0,null,1500.0,null,1500.0,null,25000.0]
[null,"Número de ejes",null,null,5.0,null,5.0,null,6.0,null,6.0,null,4.0,null,2.0,null,5.0,null,5.0,null,5.0,null,5.0,null,2.0,null,5.0,null,5.0,null,2.0,null,2.0,null,5.0]
[null,"Número de neumáticos",null,null,12.0,null,12.0,null,14.0,null,14.0,null,14.0,null,6.0,null,12.0,null,12.0,null,12.0,null,12.0,null,6.0,null,12.0,null,12.0,null,4.0,null,4.0,null,12.0]
[null,"Kilómetros recorridos anualmente",null,null,150000.0,null,120000.0,null,100000.0,null,100000.0,null,60000.0,null,90000.0,null,105000.0,null,100000.0,null,100000.0,null,120000.0,null,70000.0,null,120000.0,null,120000.0,null,50000.0,null,50000.0,null,120000.0]
[null,"Kilómetros recorridos anualmente en carga (%, km)",null,90.0,{"$f":"E9*D10/100","v":135000.0},85.0,{"$f":"G9*F10/100","v":102000.0},85.0,{"$f":"I9*H10/100","v":85000.0},85.0,85000.0,50.0,{"$f":"M9*L10/100","v":30000.0},80.0,{"$f":"O9*N10/100","v":72000.0},75.0,{"$f":"Q9*P10/100","v":78750.0},50.0,{"$f":"S9*R10/100","v":50000.0},50.0,50000.0,80.0,{"$f":"W9*V10/100","v":96000.0},75.0,{"$f":"Y9*X10/100","v":52500.0},80.0,{"$f":"AA9*Z10/100","v":96000.0},80.0,96000.0,75.0,{"$f":"AE9*AD10/100","v":37500.0},75.0,{"$f":"AG9*AF10/100","v":37500.0},85.0,{"$f":"AI9*AH10/100","v":102000.0}]
[null,"Kilómetros recorridos anualmente en vacío (%, km)",null,10.0,{"$f":"E9*D11/100","v":15000.0},15.0,{"$f":"G9*F11/100","v":18000.0},15.0,{"$f":"I9*H11/100","v":15000.0},15.0,{"$f":"K9*J11/100","v":15000.0},50.0,{"$f":"M9*L11/100","v":30000.0},20.0,{"$f":"O9*N11/100","v":18000.0},25.0,{"$f":"Q9*P11/100","v":26250.0},50.0,{"$f":"S9*R11/100","v":50000.0},50.0,{"$f":"U9*T11/100","v":50000.0},20.0,{"$f":"W9*V11/100","v":24000.0},25.0,{"$f":"Y9*X11/100","v":17500.0},20.0,{"$f":"AA9*Z11/100","v":24000.0},20.0,{"$f":"AC9*AB11/100","v":24000.0},25.0,{"$f":"AE9*AD11/100","v":12500.0},25.0,{"$f":"AG9*AF11/100","v":12500.0},15.0,{"$f":"AI9*AH11/100","v":18000.0}]
[null,"Consumo medio (litros/100km)",null,null,35.0,null,35.0,null,35.0,null,35.0,null,38.5,null,25.0,null,34.5,null,34.5,null,34.5,null,35.0,null,25.0,null,35.0,null,35.0,null,11.5,null,11.5,null,35.0]
[null,"Horas trabajadas al año",null,null,2000.0,null,1800.0,null,1800.0,null,1800.0,null,1800.0,null,1800.0,null,1800.0,null,1800.0,null,1800.0,null,1800.0,null,1800.0,null,1800.0,null,1800.0,null,1800.0,null,1800.0,null,1800.0]
[null,"Horas trabajadas al año en carga (%, h)",null,90.0,{"$f":"E13*D14/100","v":1800.0},85.0,{"$f":"G13*F14/100","v":1530.0},85.0,{"$f":"I13*H14/100","v":1530.0},85.0,1530.0,50.0,{"$f":"M13*L14/100","v":900.0},80.0,{"$f":"O13*N14/100","v":1440.0},75.0,{"$f":"Q13*P14/100","v":1350.0},50.0,{"$f":"S13*R14/100","v":900.0},50.0,900.0,80.0,{"$f":"W13*V14/100","v":1440.0},75.0,{"$f":"Y13*X14/100","v":1350.0},80.0,{"$f":"AA13*Z14/100","v":1440.0},80.0,1440.0,75.0,{"$f":"AE13*AD14/100","v":1350.0},75.0,{"$f":"AG13*AF14/100","v":1350.0},85.0,{"$f":"AI13*AH14/100","v":1530.0}]
[null,"Horas trabajadas al año en vacío (%, h)",null,10.0,{"$f":"E13*D15/100","v":200.0},15.0,{"$f":"G13*F15/100","v":270.0},15.0,{"$f":"I13*H15/100","v":270.0},15.0,{"$f":"K13*J15/100","v":270.0},50.0,{"$f":"M13*L15/100","v":900.0},20.0,{"$f":"O13*N15/100","v":360.0},25.0,{"$f":"Q13*P15/100","v":450.0},50.0,{"$f":"S13*R15/100","v":900.0},50.0,{"$f":"U13*T15/100","v":900.0},20.0,{"$f":"W13*V15/100","v":360.0},25.0,{"$f":"Y13*X15/100","v":450.0},20.0,{"$f":"AA13*Z15/100","v":360.0},20.0,{"$f":"AC13*AB15/100","v":360.0},25.0,{"$f":"AE13*AD15/100","v":450.0},25.0,{"$f":"AG13*AF15/100","v":450.0},15.0,{"$f":"AI13*AH15/100","v":270.0}]
[null,"Días trabajados al año",null,null,250.0,null,225.0,null,225.0,null,225.0,null,225.0,null,225.0,null,225.0,null,225.0,null,225.0,null,225.0,null,225.0,null,225.0,null,225.0,null,225.0,null,225.0,null,225.0]
[null,"Horas trabajadas por jornada",null,null,{"$f":"E13/E16","v":8.0},null,{"$f":"G13/G16","v":8.0},null,{"$f":"I13/I16","v":8.0},null,8.0,null,{"$f":"M13/M16","v":8.0},null,{"$f":"O13/O16","v":8.0},null,{"$f":"Q13/Q16","v":8.0},null,{"$f":"S13/S16","v":8.0},null,8.0,null,{"$f":"W13/W16","v":8.0},null,{"$f":"Y13/Y16","v":8.0},null,{"$f":"AA13/AA16","v":8.0},null,8.0,null,{"$f":"AE13/AE16","v":8.0},null,{"$f":"AG13/AG16","v":8.0},null,{"$f":"AI13/AI16","v":8.0}]
[null,"Pago de leasing o renta anual (€)",null,null,0.0,null,0.0,null,0.0,null,0.0,null,0.0,null,0.0,null,0.0,null,0.0,null,0.0,null,0.0,null,0.0,null,0.0,null,0.0,null,0.0,null,0.0,null,0.0]
[null,"Precio de tarifa sin IVA (€)",null,null,131208.73,null,131208.73,null,131208.73,null,131208.73,null,131208.73,null,81134.25,null,131208.73,null,131208.73,null,131208.73,null,131208.73,null,81134.25,null,131208.73,null,131208.73,null,27461.92,null,27461.92,null,131208.73]
[null,"Descuento sobre tarifa (%)",null,null,10.0,null,10.0,null,10.0,null,10.0,null,10.0,null,10.0,null,10.0,null,10.0,null,10.0,null,10.0,null,10.0,null,10.0,null,10.0,null,10.0,null,10.0,null,10.0]
{"$rows_left_out":105}
{"sheet":"Ibilgailu-mota","index":2,"n_rows":12,"n_cols":6,"rows_kept":12,"cut":false,"hidden":false,"merged":[]}
[]
[]
[]
[]
[]
[null,null,"1. Ibilgailu-mota hautatu"]
[]
[]
[]
[null,null,"Ibilgailu-mota:",null,{"$f":"VLOOKUP(F10,T!A2:B17,2,0)","v":"T1"},"Ibilbide luzeko zama arrunteko ibilgailu artikulatua"]
[]
[null,null,"Kalkulu-formularioetara gehitutako datu estatistikoekin simulazioa hasi nahi duzu?"]

{"sheet":"Ibilgailuaren Ezaugarriak","index":3,"n_rows":41,"n_cols":22,"rows_kept":41,"cut":false,"hidden":false,"merged":[[10,9,10,12]]}
[]
[]
[]
[]
[]
[null,null,"1. Ibilgailuaren Ezaugarriak"]
[]
[]
[null,null,"Ibilgailuaren ezaugarri teknikoak ",null,null,null,null,null,null,null,null,"Datu estadistikoak",{"$f":"DE!$AJ$2","v":"20/06/2025"}]
[]
[null,null,"Deskripzioa:",null,null,null,null,null,null,{"$f":"IF(HLOOKUP('Ibilgailu-mota'!$E$10,DE!$E$1:$AI$283,2,0)=\"\",\"\",HLOOKUP('Ibilgailu-mota'!$E$10,DE!$E$1:$AI$283,2,0))","v":"Ibilbide luzeko zama arrunteko ibilgailu artikulatua"},null,null,null,null,null,null,null,null,null,null,null,"2024-01-12"]
[]
[null,null,"Potentzia:",null,null,null,null,null,null,null,null,{"$f":"IF(HLOOKUP('Ibilgailu-mota'!$E$10,DE!$D$1:$AI$281,4,0)=\"\",\"\",HLOOKUP('Ibilgailu-mota'!$E$10,DE!$D$1:$AI$281,4,0))","v":200}]
[]
[null,null,"MMA (Tm):",null,null,null,null,null,null,null,null,{"$f":"IF(HLOOKUP('Ibilgailu-mota'!$E$10,DE!$D$1:$AI$281,5,0)=\"\",\"\",HLOOKUP('Ibilgailu-mota'!$E$10,DE!$D$1:$AI$281,5,0))","v":41000}]
[]
[null,null,"Karga erabilgarria:",null,null,null,null,null,null,null,null,{"$f":"IF(HLOOKUP('Ibilgailu-mota'!$E$10,DE!$D$1:$AI$281,6,0)=\"\",\"\",HLOOKUP('Ibilgailu-mota'!$E$10,DE!$D$1:$AI$281,6,0))","v":25000}]
[]
[null,null,"Ardatz-kopurua:",null,null,null,null,null,null,null,null,{"$f":"IF(HLOOKUP('Ibilgailu-mota'!$E$10,DE!$D$1:$AI$281,7,0)=\"\",\"\",HLOOKUP('Ibilgailu-mota'!$E$10,DE!$D$1:$AI$281,7,0))","v":6}]
[]
{"$rows_left_out":22}
{"sheet":"Erosketa kostuak","index":4,"n_rows":105,"n_cols":11,"rows_kept":105,"cut":false,"hidden":false,"merged":[[10,7,10,8],[34,7,34,8],[58,7,58,8],[82,7,82,8]]}
[]
[]
[]
[]
[]
[null,null,"2. Erosketa kostuak"]
[]
[]
[null,null,"Trakziozko Ibilgailua ",null,null,null,null,null,null,"Datu estadistikoak",{"$f":"DE!$AJ$2","v":"20/06/2025"}]
[null,null,null,null,null,null,null,null,null,{"$f":"IF(HLOOKUP('Ibilgailu-mota'!$E$10,DE!$D$1:$AX$283,3,0)=\"\",\"\",HLOOKUP('Ibilgailu-mota'!$E$10,DE!$D$1:$AX$283,3,0))","v":5.6099999999999997E-2}]
[null,null,"Erosteko modua:",null,null,null,null," EROSKETA"]
[]
[null,null,"Leasinga edo urteko errenta ordainduz (€)",null,null,null,null,0,null,{"$f":"IF(HLOOKUP('Ibilgailu-mota'!$E$10,DE!$D$1:$AI$281,18,0)=\"\",\"\",HLOOKUP('Ibilgailu-mota'!$E$10,DE!$D$1:$AI$281,18,0))","v":0}]
[]
[null,null,"Trakziozko ibilgailuaren erosketa  (€) "]
[]
[null,null,"Tarifako prezioa BEZ gabe (€)",null,null,null,null,null,null,{"$f":"IF(HLOOKUP('Ibilgailu-mota'!$E$10,DE!$D$1:$AI$281,19,0)=\"\",\"\",HLOOKUP('Ibilgailu-mota'!$E$10,DE!$D$1:$AI$281,19,0))","v":128243.27}]
[]
[null,null,"Tarifa gaineko deskontua (%)",null,null,null,null,null,null,{"$f":"IF(HLOOKUP('Ibilgailu-mota'!$E$10,DE!$D$1:$AI$281,20,0)=\"\",\"\",HLOOKUP('Ibilgailu-mota'!$E$10,DE!$D$1:$AI$281,20,0))","v":10}]
[]
{"$rows_left_out":86}
{"sheet":"Pertsonal-kostuak","index":5,"n_rows":23,"n_cols":11,"rows_kept":23,"cut":false,"hidden":false,"merged":[]}
[]
[]
[]
[]
[]
[null,null,"3. Pertsonal-kostuak "]
[]
[]
[null,null,"Pertsonal-kostuak ",null,null,null,null,null,null,"Datu estadistikoak",{"$f":"DE!$AJ$2","v":"20/06/2025"}]
[]
[null,null,"Gidariaren urteko kostua guztira, enpresa-kostuak barne (Gizarte Seg. eta abar)  €",null,null,null,null,null,null,{"$f":"IF(HLOOKUP('Ibilgailu-mota'!$E$10,DE!$D$1:$AI$281,51,0)=\"\",\"\",HLOOKUP('Ibilgailu-mota'!$E$10,DE!$D$1:$AI$281,51,0))","v":37649.699999999997}]
[]
[null,null,"Gidariaren eguneko dieta guztira (€/eguneko) ",null,null,null,null,null,null,{"$f":"IF(HLOOKUP('Ibilgailu-mota'!$E$10,DE!$D$1:$AI$281,52,0)=\"\",\"\",HLOOKUP('Ibilgailu-mota'!$E$10,DE!$D$1:$AI$281,52,0))","v":84.2}]
[]
[null,null,"Urteko dieta egun-kopurua ",null,null,null,null,null,null,{"$f":"IF(HLOOKUP('Ibilgailu-mota'!$E$10,DE!$D$1:$AI$281,53,0)=\"\",\"\",HLOOKUP('Ibilgailu-mota'!$E$10,DE!$D$1:$AI$281,53,0))","v":250}]
[]
[null,null,"Urteko dieta guztiak (€)",null,null,null,null,{"$f":"H15*H13","v":0},null,{"$f":"IF(HLOOKUP('Ibilgailu-mota'!$E$10,DE!$D$1:$AI$281,54,0)=\"\",\"\",HLOOKUP('Ibilgailu-mota'!$E$10,DE!$D$1:$AI$281,54,0))","v":21050}]
[]
[null,null,"Gidariaren urteko jarduera-plusa (€/km) ",null,null,null,null,null,null,{"$f":"IF(HLOOKUP('Ibilgailu-mota'!$E$10,DE!$D$1:$AI$281,55,0)=\"\",\"\",HLOOKUP('Ibilgailu-mota'!$E$10,DE!$D$1:$AI$281,55,0))","v":6.4000000000000001E-2}]
[]
{"$rows_left_out":4}
{"sheet":"Aseguruak eta zerga arloko kost","index":6,"n_rows":49,"n_cols":11,"rows_kept":49,"cut":false,"hidden":false,"merged":[]}
[]
[]
[]
[]
[]
[null,null,"4. Aseguruak eta zerga arloko kostuak"]
[]
[]
[null,null,"Seguros",null,null,null,null,null,null,"Datu estadistikoak",{"$f":"DE!$AJ$2","v":"20/06/2025"}]
[]
[null,null,"Responsabilidad civil del vehículo de tracción (€)",null,null,null,null,null,null,{"$f":"IF(HLOOKUP('Ibilgailu-mota'!$E$10,DE!$D$1:$AI$281,58,0)=\"\",\"\",HLOOKUP('Ibilgailu-mota'!$E$10,DE!$D$1:$AI$281,58,0))","v":1696.86}]
[]
[null,null,"Responsabilidad civil del remolque o semirremolque (€)",null,null,null,null,null,null,{"$f":"IF(HLOOKUP('Ibilgailu-mota'!$E$10,DE!$D$1:$AI$281,59,0)=\"\",\"\",HLOOKUP('Ibilgailu-mota'!$E$10,DE!$D$1:$AI$281,59,0))","v":535.32000000000005}]
[]
[null,null,"Responsabilidad civil de la mercancía (€)",null,null,null,null,null,null,{"$f":"IF(HLOOKUP('Ibilgailu-mota'!$E$10,DE!$D$1:$AI$281,60,0)=\"\",\"\",HLOOKUP('Ibilgailu-mota'!$E$10,DE!$D$1:$AI$281,60,0))","v":127.19}]
[]
[null,null,"Accidente del conductor (€)",null,null,null,null,null,null,{"$f":"IF(HLOOKUP('Ibilgailu-mota'!$E$10,DE!$D$1:$AI$281,61,0)=\"\",\"\",HLOOKUP('Ibilgailu-mota'!$E$10,DE!$D$1:$AI$281,61,0))","v":59.04}]
[]
[null,null,"Retirada del carné de conducir (€)",null,null,null,null,null,null,{"$f":"IF(HLOOKUP('Ibilgailu-mota'!$E$10,DE!$D$1:$AI$281,62,0)=\"\",\"\",HLOOKUP('Ibilgailu-mota'!$E$10,DE!$D$1:$AI$281,62,0))","v":146.94999999999999}]
[]
{"$rows_left_out":30}
{"sheet":"Kostu aldakorrak","index":7,"n_rows":89,"n_cols":13,"rows_kept":89,"cut":false,"hidden":false,"merged":[]}
[]
[]
[]
[]
[]
[null,null,"5. Kostu aldakorrak"]
[]
[]
[null,null,"Ibilgailuaren erregaia ",null,null,null,null,null,null,null,null,"Datu estadistikoak",{"$f":"DE!$AJ$2","v":"20/06/2025"}]
[]
[null,null,"Erregaiaren prezioa BEZ barne (€/litroko) ",null,null,null,null,null,null,null,null,{"$f":"IF(HLOOKUP('Ibilgailu-mota'!$E$10,DE!$D$1:$AI$281,77,0)=\"\",\"\",HLOOKUP('Ibilgailu-mota'!$E$10,DE!$D$1:$AI$281,77,0))","v":2.1230000000000002}]
[]
[null,null,"Deskontua (€/litroko)",null,null,null,null,null,null,null,null,{"$f":"IF(HLOOKUP('Ibilgailu-mota'!$E$10,DE!$D$1:$AI$281,78,0)=\"\",\"\",HLOOKUP('Ibilgailu-mota'!$E$10,DE!$D$1:$AI$281,78,0))","v":0.1159}]
[]
[null,null,"Erregaiari aplikatutako BEZa (€/litroKO) ",null,null,null,null,null,"%",{"$f":"IFERROR(ROUND((H15/100)*(J11-J13)/(1+H15/100),4),0)","v":0},{"$f":"IF(HLOOKUP(CONCATENATE('Ibilgailu-mota'!$E$10,\"A\"),DE!$D$1:$AI$281,79,0)=\"\",\"\",HLOOKUP(CONCATENATE('Ibilgailu-mota'!$E$10,\"A\"),DE!$D$1:$AI$281,79,0))","v":21},{"$f":"IF(HLOOKUP('Ibilgailu-mota'!$E$10,DE!$D$1:$AI$281,79,0)=\"\",\"\",HLOOKUP('Ibilgailu-mota'!$E$10,DE!$D$1:$AI$281,79,0))","v":0.3483}]
[]
[null,null,"Erregaiaren prezioa BEZ gabe (€/litroko) ",null,null,null,null,null,null,{"$f":"IFERROR(ROUND((J11-J13)/(1+H15/100),4),0)","v":0},null,{"$f":"IF(HLOOKUP('Ibilgailu-mota'!$E$10,DE!$D$1:$AI$281,80,0)=\"\",\"\",HLOOKUP('Ibilgailu-mota'!$E$10,DE!$D$1:$AI$281,80,0))","v":1.6588000000000001}]
[]
[null,null,"IBILGAILUAREN ERREGAIAN URTEAN GUZTIRA GASTATUTAKOA (€)",null,null,null,null,null,null,{"$f":"IFERROR(ROUND(('Ibilgailuaren Ezaugarriak'!J25/100)*'Ibilgailuaren Ezaugarriak'!J31*J17,0),0)","v":0},null,{"$f":"IF(HLOOKUP('Ibilgailu-mota'!$E$10,DE!$D$1:$AI$281,81,0)=\"\",\"\",HLOOKUP('Ibilgailu-mota'!$E$10,DE!$D$1:$AI$281,81,0))","v":87087}]
[]
{"$rows_left_out":70}
{"sheet":"Zeharkako kostuak ","index":8,"n_rows":15,"n_cols":12,"rows_kept":15,"cut":false,"hidden":false,"merged":[]}
[]
[]
[]
[]
[]
[null,null,"6. Zeharkako kostuak "]
[]
[]
[null,null,"Zeharkako kostuak ",null,null,null,null,null,null,"Datu estadistikoak",{"$f":"DE!$AJ$2","v":"20/06/2025"}]
[]
[null,null,"% Urteko kudeaketa-, administrazio- eta merkaturatze-kostuak, ibilgailu honi dagozkionak",null,null,null,null,null,"%",{"$f":"ROUND(('Erosketa kostuak'!H105+'Pertsonal-kostuak'!H23+'Aseguruak eta zerga arloko kost'!H49+'Kostu aldakorrak'!J89)*('Zeharkako kostuak '!H11/100),0)","v":0},{"$f":"IF(HLOOKUP(CONCATENATE('Ibilgailu-mota'!$E$10,\"A\"),DE!$D$1:$AI$281,109,0)=\"\",\"\",HLOOKUP(CONCATENATE('Ibilgailu-mota'!$E$10,\"A\"),DE!$D$1:$AI$281,109,0))","v":6.5},{"$f":"IF(HLOOKUP('Ibilgailu-mota'!$E$10,DE!$D$1:$AI$281,109,0)=\"\",\"\",HLOOKUP('Ibilgailu-mota'!$E$10,DE!$D$1:$AI$281,109,0))","v":14723}]
[]
[]
[]
[null,null,"ZEHARKAKO GASTUAK",null,null,null,null,{"$f":"J11","v":0},null,{"$f":"IF(HLOOKUP('Ibilgailu-mota'!$E$10,DE!$D$1:$AI$281,112,0)=\"\",\"\",HLOOKUP('Ibilgailu-mota'!$E$10,DE!$D$1:$AI$281,112,0))","v":14723}]

{"sheet":"Emaitzak","index":9,"n_rows":97,"n_cols":16,"rows_kept":97,"cut":false,"hidden":false,"merged":[[90,7,90,8],[90,4,90,5],[8,4,8,5],[40,7,40,8],[40,4,40,5],[67,7,67,8],[67,4,67,5]]}
[]
[]
[]
[]
[]
[null,null,"Emaitzak"]
[]
[]
[null,null,"URTEKO KOSTUEN EMAITZAK ",null,"Erabiltzailea",null,null,"Datu estadistikoak",{"$f":"DE!$AJ$2","v":"20/06/2025"}]
[null,null,null,null,"Euro","%",null,"Euro","%"]
[null,null,"GUZTIZKO KOSTUAK ",null,{"$f":"ROUND(E12+E21,0)","v":0},100,null,{"$f":"ROUND(H12+H21,0)","v":226514},100]
[null,null,"KOSTUAK DENBORAREN ARABERA ",null,{"$f":"ROUND(IFERROR(SUM(E13:E20),0),0)","v":0},{"$f":"IFERROR(E12*F11/E11,0)","v":0},null,{"$f":"ROUND(IFERROR(SUM(H13:H20),0),0)","v":102009},{"$f":"IFERROR(H12*I11/H11,0)","v":45.034302515517801}]
[null,null,"Leasinga","A",{"$f":"ROUND(IFERROR('Erosketa kostuak'!H13+0,0)+IFERROR('Erosketa kostuak'!H37+0,0)+IFERROR('Erosketa kostuak'!H61+0,0)+IFERROR('Erosketa kostuak'!H85+0,0),0)","v":0},{"$f":"IFERROR(E13*F$11/E$11,0)","v":0},"A",{"$f":"ROUND(IFERROR('Erosketa kostuak'!J13+0,0)+IFERROR('Erosketa kostuak'!J37+0,0)+IFERROR('Erosketa kostuak'!J61+0,0)+IFERROR('Erosketa kostuak'!J85+0,0),0)","v":0},{"$f":"IFERROR(H13*I$11/H$11,0)","v":0},null,"A",{"$f":"E13","v":0},0,"A",{"$f":"H13","v":0},0]
[null,null,"Amortizazioa","B",{"$f":"ROUND(IFERROR(0+'Erosketa kostuak'!H29,0)+IFERROR(0+'Erosketa kostuak'!H53,0)+IFERROR(0+'Erosketa kostuak'!H77,0)+IFERROR(0+'Erosketa kostuak'!H101,0),0)","v":0},0,"B",{"$f":"ROUND(IFERROR(0+'Erosketa kostuak'!J29,0)+IFERROR(0+'Erosketa kostuak'!J53,0)+IFERROR(0+'Erosketa kostuak'!J77,0)+IFERROR(0+'Erosketa kostuak'!J101,0),0)","v":21756},9.6047043449852989,null,"B",0,0,"B",21756,9.6047043449852989]
[null,null,"Finantza-gastuak ","C",{"$f":"ROUND(IFERROR(0+'Erosketa kostuak'!H31,0)+IFERROR(0+'Erosketa kostuak'!H55,0)+IFERROR(0+'Erosketa kostuak'!H79,0)+IFERROR(0+'Erosketa kostuak'!H103,0),0)","v":0},0,"C",{"$f":"ROUND(IFERROR(0+'Erosketa kostuak'!J31,0)+IFERROR(0+'Erosketa kostuak'!J55,0)+IFERROR(0+'Erosketa kostuak'!J79,0)+IFERROR(0+'Erosketa kostuak'!J103,0),0)","v":4058},1.7915007460907493,null,"C",0,0,"C",4058,1.7915007460907493]
[null,null,"Gidariaren urteko kostua guztira ","D",{"$f":"ROUND('Pertsonal-kostuak'!H11,0)","v":0},0,"D",{"$f":"ROUND('Pertsonal-kostuak'!J11,0)","v":37650},16.621489179476765,null,"D",0,0,"D",37650,16.621489179476765]
[null,null,"Dietak guztira eta jarduera-plusa ","E",{"$f":"ROUND('Pertsonal-kostuak'!H17+'Pertsonal-kostuak'!H21,0)","v":0},0,"E",{"$f":"ROUND('Pertsonal-kostuak'!J17+'Pertsonal-kostuak'!J21,0)","v":30650},13.531172466161031,null,"E",0,0,"E",30650,13.531172466161031]
[null,null,"Seguruak","F",{"$f":"ROUND('Aseguruak eta zerga arloko kost'!H27,0)","v":0},0,"F",{"$f":"ROUND('Aseguruak eta zerga arloko kost'!J27,0)","v":6965},3.0748651297491545,null,"F",0,0,"F",6965,3.0748651297491545]
[null,null,"Zerga-arloko kostuak ","G",{"$f":"ROUND('Aseguruak eta zerga arloko kost'!H47,0)","v":0},0,"G",{"$f":"ROUND('Aseguruak eta zerga arloko kost'!J47,0)","v":930},0.41057064905480456,null,"G",0,0,"G",930,0.41057064905480456]
[null,null,"Kudeaketa eta merkaturatzea ","H",{"$f":"ROUND('Zeharkako kostuak '!H15,0)","v":0},0,"H",{"$f":"ROUND('Zeharkako kostuak '!J11,0)","v":0},0,null,"H",0,0,"H",0,0]
{"$rows_left_out":78}
{"sheet":"Zerbitzuaren kostua","index":10,"n_rows":37,"n_cols":8,"rows_kept":37,"cut":false,"hidden":false,"merged":[[10,7,10,10]]}
[]
[]
[]
[]
[]
[null,null,"Zerbitzuaren kostua"]
[]
[]
[null,null,"Zerbitzuaren kostua "]
[]
[null,null,"Zerbitzuaren izena "]
[]
[null,null,"Zerbitzu honetan egindako kilometroak (zamarekin hutsik)  (km)",null,null,null,null,{"$f":"H15+H17","v":0}]
[]
[null,null,"Kilometroak zamarekin (km) "]
[]
[null,null,"Kilometroak hutsik (km) "]
[]
[null,null,"Zerbitzu honetako batez besteko kontsumoa kilometroko (litro / 100 km) "]
[]
{"$rows_left_out":17}