{"text_format":"1","workbook":"xlsx","n_sheets":6,"sheets":["T","DE","Tipo Vehículo","Cálculo Simplificado","Resultados","Coste Servicio"],"not_rendered":{"charts":4,"images":8,"macros":1,"external_links":0,"defined_names":10,"comments":0,"pivot_tables":0},"unopened":[],"bounds":{"document_bytes":16777216,"sheet_cells":100000,"rows_first":2000,"rows_last":500,"rows_between":2000,"halvings":0,"cell_chars":16384,"cell_head_chars":4096},"cells_cut":0,"cells_raw":0,"read":"whole","date_system":"1900"}

{"sheet":"T","index":0,"n_rows":17,"n_cols":8,"rows_kept":17,"cut":false,"hidden":true,"merged":[]}
["Tipo de vehículo",null,"Pregunta",null,null,"Adquisicion",null,"Editar"]
["Vehículo articulado de carga general de larga distancia","T1","Si","S",null,"Compra"]
["Vehículo articulado de carga general de corta distancia","T2","No","N",null,"Alquiler, leasing…"]
["Portacontenedores de larga distancia","T3"]
["Portacontenedores de corta distancia","T4"]
["Volquete articulado de obra","T5"]
["Vehículo de 2 ejes de carga general","T6"]
["Vehículo articulado de mercancías peligrosas (químicas) de larga distancia","T7"]
["Vehículo articulado de productos derivados del petróleo (gasoil, gasolina, fueloil)","T8"]
["Vehículo cisterna de mercancías peligrosas (gases) de larga distancia","T9"]
["Vehículo frigorífico articulado","T10"]
["Vehículo frigorífico de 2 ejes","T11"]
["Volquete graneles de larga distancia","T12"]
["Volquete graneles de corta distancia","T13"]
["Camión ligero 3T distribución","T14"]
["Furgonetas","T15"]
["Vehículo genérico (para todos aquellos vehículos que no puedan ser englobados en las categorías anteriores)","T16"]

{"sheet":"DE","index":1,"n_rows":125,"n_cols":36,"rows_kept":125,"cut":false,"hidden":true,"merged":[]}
[null,null,null,"T1A","T1","T2A","T2","T3A","T3","T4A","T4","T5A","T5","T6A","T6","T7A","T7","T8A","T8","T9A","T9","T10A","T10","T11A","T11","T12A","T12","T13A","T13","T14A","T14","T15A","T15","T16A","T16"]
[null,"Descripción:",null," ","Vehículo articulado de carga general de larga distancia"," ","Vehículo articulado de carga general de corta distancia"," ","Portacontenedores de larga distancia"," ","Portacontenedores de corta distancia"," ","Volquete articulado de obra"," ","Vehículo de 2 ejes de carga general"," ","Vehículo articulado de mercancías peligrosas (químicas) de larga distancia"," ","Vehículo articulado de productos derivados del petróleo (gasoil, gasolina, fueloil)"," ","Vehículo cisterna de mercancías peligrosas (gases) de larga distancia"," ","Vehículo frigorífico articulado"," ","Vehículo frigorífico de 2 ejes"," ","Volquete graneles de larga distancia"," ","Volquete graneles de corta distancia"," ","Camión ligero 3T distribución"," ","Furgonetas"," ","Vehículo genérico (para todos aquellos vehículos que no puedan ser englobados en las categorías anteriores)","03/07/2025"]
[null,"Tipo interes",null,null,0.0453,null,0.0453,null,0.0453,null,0.0453,null,0.0453,null,0.0453,null,0.0453,null,0.0453,null,0.0453,null,0.0453,null,0.0453,null,0.0453,null,0.0453,null,0.0453,null,0.0453,null,0.0453]
[null,"Potencia",null,null,455.0,null,455.0,null,455.0,null,455.0,null,455.0,null,280.0,null,455.0,null,455.0,null,455.0,null,455.0,null,280.0,null,455.0,null,455.0,null,130.0,null,130.0,null,455.0]
[null,"MMA",null,null,40000.0,null,40000.0,null,44000.0,null,44000.0,null,40000.0,null,18000.0,null,40000.0,null,40000.0,null,40000.0,null,40000.0,null,18000.0,null,40000.0,null,40000.0,null,35000.0,null,3500.0,null,40000.0]
[null,"Carga útil",null,null,25000.0,null,25000.0,null,26250.0,null,26250.0,null,23000.0,null,9500.0,null,0.0,null,0.0,null,0.0,null,24000.0,null,9000.0,null,24000.0,null,24000.0,null,1500.0,null,1500.0,null,25000.0]
[null,"Número de ejes",null,null,5.0,null,5.0,null,6.0,null,6.0,null,4.0,null,2.0,null,5.0,null,5.0,null,5.0,null,5.0,null,2.0,null,5.0,null,5.0,null,2.0,null,2.0,null,5.0]
[null,"Número de neumáticos",null,null,12.0,null,12.0,null,14.0,null,14.0,null,14.0,null,6.0,null,12.0,null,12.0,null,12.0,null,12.0,null,6.0,null,12.0,null,12.0,null,4.0,null,4.0,null,12.0]
[null,"Kilómetros recorridos anualmente",null,null,150000.0,null,120000.0,null,100000.0,null,100000.0,null,60000.0,null,90000.0,null,105000.0,null,100000.0,null,100000.0,null,120000.0,null,70000.0,null,120000.0,null,120000.0,null,50000.0,null,50000.0,null,120000.0]
[null,"Kilómetros recorridos anualmente en carga (%, km)",null,90.0,{"$f":"E9*D10/100","v":135000.0},85.0,{"$f":"G9*F10/100","v":102000.0},85.0,{"$f":"I9*H10/100","v":85000.0},85.0,85000.0,50.0,{"$f":"M9*L10/100","v":30000.0},80.0,{"$f":"O9*N10/100","v":72000.0},75.0,{"$f":"Q9*P10/100","v":78750.0},50.0,{"$f":"S9*R10/100","v":50000.0},50.0,50000.0,80.0,{"$f":"W9*V10/100","v":96000.0},75.0,{"$f":"Y9*X10/100","v":52500.0},80.0,{"$f":"AA9*Z10/100","v":96000.0},80.0,96000.0,75.0,{"$f":"AE9*AD10/100","v":37500.0},75.0,{"$f":"AG9*AF10/100","v":37500.0},85.0,{"$f":"AI9*AH10/100","v":102000.0}]
[null,"Kilómetros recorridos anualmente en vacío (%, km)",null,10.0,{"$f":"E9*D11/100","v":15000.0},15.0,{"$f":"G9*F11/100","v":18000.0},15.0,{"$f":"I9*H11/100","v":15000.0},15.0,{"$f":"K9*J11/100","v":15000.0},50.0,{"$f":"M9*L11/100","v":30000.0},20.0,{"$f":"O9*N11/100","v":18000.0},25.0,{"$f":"Q9*P11/100","v":26250.0},50.0,{"$f":"S9*R11/100","v":50000.0},50.0,{"$f":"U9*T11/100","v":50000.0},20.0,{"$f":"W9*V11/100","v":24000.0},25.0,{"$f":"Y9*X11/100","v":17500.0},20.0,{"$f":"AA9*Z11/100","v":24000.0},20.0,{"$f":"AC9*AB11/100","v":24000.0},25.0,{"$f":"AE9*AD11/100","v":12500.0},25.0,{"$f":"AG9*AF11/100","v":12500.0},15.0,{"$f":"AI9*AH11/100","v":18000.0}]
[null,"Consumo medio (litros/100km)",null,null,35.0,null,35.0,null,35.0,null,35.0,null,38.5,null,25.0,null,34.5,null,34.5,null,34.5,null,35.0,null,25.0,null,35.0,null,35.0,null,11.5,null,11.5,null,35.0]
[null,"Horas trabajadas al año",null,null,2000.0,null,1800.0,null,1800.0,null,1800.0,null,1800.0,null,1800.0,null,1800.0,null,1800.0,null,1800.0,null,1800.0,null,1800.0,null,1800.0,null,1800.0,null,1800.0,null,1800.0,null,1800.0]
[null,"Horas trabajadas al año en carga (%, h)",null,90.0,{"$f":"E13*D14/100","v":1800.0},85.0,{"$f":"G13*F14/100","v":1530.0},85.0,{"$f":"I13*H14/100","v":1530.0},85.0,1530.0,50.0,{"$f":"M13*L14/100","v":900.0},80.0,{"$f":"O13*N14/100","v":1440.0},75.0,{"$f":"Q13*P14/100","v":1350.0},50.0,{"$f":"S13*R14/100","v":900.0},50.0,900.0,80.0,{"$f":"W13*V14/100","v":1440.0},75.0,{"$f":"Y13*X14/100","v":1350.0},80.0,{"$f":"AA13*Z14/100","v":1440.0},80.0,1440.0,75.0,{"$f":"AE13*AD14/100","v":1350.0},75.0,{"$f":"AG13*AF14/100","v":1350.0},85.0,{"$f":"AI13*AH14/100","v":1530.0}]
[null,"Horas trabajadas al año en vacío (%, h)",null,10.0,{"$f":"E13*D15/100","v":200.0},15.0,{"$f":"G13*F15/100","v":270.0},15.0,{"$f":"I13*H15/100","v":270.0},15.0,{"$f":"K13*J15/100","v":270.0},50.0,{"$f":"M13*L15/100","v":900.0},20.0,{"$f":"O13*N15/100","v":360.0},25.0,{"$f":"Q13*P15/100","v":450.0},50.0,{"$f":"S13*R15/100","v":900.0},50.0,{"$f":"U13*T15/100","v":900.0},20.0,{"$f":"W13*V15/100","v":360.0},25.0,{"$f":"Y13*X15/100","v":450.0},20.0,{"$f":"AA13*Z15/100","v":360.0},20.0,{"$f":"AC13*AB15/100","v":360.0},25.0,{"$f":"AE13*AD15/100","v":450.0},25.0,{"$f":"AG13*AF15/100","v":450.0},15.0,{"$f":"AI13*AH15/100","v":270.0}]
[null,"Días trabajados al año",null,null,250.0,null,225.0,null,225.0,null,225.0,null,225.0,null,225.0,null,225.0,null,225.0,null,225.0,null,225.0,null,225.0,null,225.0,null,225.0,null,225.0,null,225.0,null,225.0]
[null,"Horas trabajadas por jornada",null,null,{"$f":"E13/E16","v":8.0},null,{"$f":"G13/G16","v":8.0},null,{"$f":"I13/I16","v":8.0},null,8.0,null,{"$f":"M13/M16","v":8.0},null,{"$f":"O13/O16","v":8.0},null,{"$f":"Q13/Q16","v":8.0},null,{"$f":"S13/S16","v":8.0},null,8.0,null,{"$f":"W13/W16","v":8.0},null,{"$f":"Y13/Y16","v":8.0},null,{"$f":"AA13/AA16","v":8.0},null,8.0,null,{"$f":"AE13/AE16","v":8.0},null,{"$f":"AG13/AG16","v":8.0},null,{"$f":"AI13/AI16","v":8.0}]
[null,"Pago de leasing o renta anual (€)",null,null,0.0,null,0.0,null,0.0,null,0.0,null,0.0,null,0.0,null,0.0,null,0.0,null,0.0,null,0.0,null,0.0,null,0.0,null,0.0,null,0.0,null,0.0,null,0.0]
[null,"Precio de tarifa sin IVA (€)",null,null,129778.36,null,129778.36,null,129778.36,null,129778.36,null,129778.36,null,80249.76,null,129778.36,null,129778.36,null,129778.36,null,129778.36,null,80249.76,null,129778.36,null,129778.36,null,27162.55,null,27162.55,null,129778.36]
[null,"Descuento sobre tarifa (%)",null,null,10.0,null,10.0,null,10.0,null,10.0,null,10.0,null,10.0,null,10.0,null,10.0,null,10.0,null,10.0,null,10.0,null,10.0,null,10.0,null,10.0,null,10.0,null,10.0]
[null,"Precio de adquisición sin IVA (€)",null,null,{"$f":"ROUND((1-E20/100)*E19,0)","v":116801.0},null,{"$f":"(1-G20/100)*G19","v":116801.0},null,{"$f":"(1-I20/100)*I19","v":116801.0},null,116801.0,null,{"$f":"(1-M20/100)*M19","v":116801.0},null,{"$f":"(1-O20/100)*O19","v":72225.0},null,{"$f":"(1-Q20/100)*Q19","v":116801.0},null,{"$f":"(1-S20/100)*S19","v":116801.0},null,116801.0,null,{"$f":"(1-W20/100)*W19","v":116801.0},null,{"$f":"(1-Y20/100)*Y19","v":72225.0},null,{"$f":"(1-AA20/100)*AA19","v":116801.0},null,116801.0,null,{"$f":"(1-AE20/100)*AE19","v":24446.0},null,{"$f":"(1-AG20/100)*AG19","v":24446.0},null,{"$f":"(1-AI20/100)*AI19","v":116801.0}]
[null,"Vida útil (años)",null,null,5.0,null,6.0,null,8.0,null,8.0,null,8.0,null,10.0,null,6.0,null,6.0,null,6.0,null,6.0,null,10.0,null,6.0,null,6.0,null,8.0,null,8.0,null,6.0]
[null,"Valor residual sobre precio de tarifa (%)",null,15.0,{"$f":"ROUND(E19*D23/100,0)","v":19467.0},20.0,{"$f":"G19*F23/100","v":25956.0},20.0,{"$f":"I19*H23/100","v":25956.0},20.0,{"$f":"K19*J23/100","v":25956.0},20.0,{"$f":"M19*L23/100","v":25956.0},10.0,{"$f":"O19*N23/100","v":8025.0},20.0,{"$f":"Q19*P23/100","v":25956.0},20.0,{"$f":"S19*R23/100","v":25956.0},20.0,{"$f":"U19*T23/100","v":25956.0},20.0,{"$f":"W19*V23/100","v":25956.0},10.0,{"$f":"Y19*X23/100","v":8025.0},20.0,{"$f":"AA19*Z23/100","v":25956.0},20.0,{"$f":"AC19*AB23/100","v":25956.0},15.0,{"$f":"AE19*AD23/100","v":4074.0},15.0,{"$f":"AG19*AF23/100","v":4074.0},20.0,{"$f":"AI19*AH23/100","v":25956.0}]
[null,"AMORTIZACIÓN DEL VEHÍCULO DE TRACCIÓN",null,null,{"$f":"IFERROR(ROUND((E21-E23-E102)/E22,0),0)","v":17742.0},null,{"$f":"IFERROR(ROUND((G21-G23-G102)/G22,0),0)","v":13991.0},null,{"$f":"IFERROR(ROUND((I21-I23-I102)/I22,0),0)","v":10517.0},null,{"$f":"IFERROR(ROUND((K21-K23-K102)/K22,0),0)","v":10517.0},null,{"$f":"IFERROR(ROUND((M21-M23-M102)/M22,0),0)","v":9846.0},null,{"$f":"IFERROR(ROUND((O21-O23-O102)/O22,0),0)","v":6091.0},null,{"$f":"IFERROR(ROUND((Q21-Q23-Q102)/Q22,0),0)","v":14134.0},null,{"$f":"IFERROR(ROUND((S21-S23-S102)/S22,0),0)","v":14182.0},null,{"$f":"IFERROR(ROUND((U21-U23-U102)/U22,0),0)","v":14182.0},null,{"$f":"IFERROR(ROUND((W21-W23-W102)/W22,0),0)","v":13991.0},null,{"$f":"IFERROR(ROUND((Y21-Y23-Y102)/Y22,0),0)","v":6164.0},null,{"$f":"IFERROR(ROUND((AA21-AA23-AA102)/AA22,0),0)","v":13991.0},null,{"$f":"IFERROR(ROUND((AC21-AC23-AC102)/AC22,0),0)","v":13991.0},null,{"$f":"IFERROR(ROUND((AE21-AE23-AE102)/AE22,0),0)","v":2459.0},null,{"$f":"IFERROR(ROUND((AG21-AG23-AG102)/AG22,0),0)","v":2459.0},null,{"$f":"IFERROR(ROUND((AI21-AI23-AI102)/AI22,0),0)","v":13991.0}]
[null,"GASTOS FINANCIEROS DEL VEHÍCULO DE TRACCIÓN",null,null,{"$f":"IFERROR(ROUND((E21-E23-E102)*(E$3/(1-POWER(1+E$3,-E22))-1/E22),0),0)","v":2482.0},null,{"$f":"IFERROR(ROUND((G21-G23-G102)*(G$3/(1-POWER(1+G$3,-G22))-1/G22),0),0)","v":2300.0},null,{"$f":"IFERROR(ROUND((I21-I23-I102)*(I$3/(1-POWER(1+I$3,-I22))-1/I22),0),0)","v":2254.0},null,{"$f":"IFERROR(ROUND((K21-K23-K102)*(K$3/(1-POWER(1+K$3,-K22))-1/K22),0),0)","v":2254.0},null,{"$f":"IFERROR(ROUND((M21-M23-M90*M94-M91*M95-M92*M96)*(M$3/(1-POWER(1+M$3,-M22))-1/M22),0),0)","v":2111.0},null,{"$f":"IFERROR(ROUND((O21-O23-O102)*(O$3/(1-POWER(1+O$3,-O22))-1/O22),0),0)","v":1618.0},null,{"$f":"IFERROR(ROUND((Q21-Q23-Q102)*(Q$3/(1-POWER(1+Q$3,-Q22))-1/Q22),0),0)","v":2324.0},null,{"$f":"IFERROR(ROUND((S21-S23-S90*S102)*(S$3/(1-POWER(1+S$3,-S22))-1/S22),0),0)","v":2332.0},null,{"$f":"IFERROR(ROUND((U21-U23-U102)*(U$3/(1-POWER(1+U$3,-U22))-1/U22),0),0)","v":2332.0},null,{"$f":"IFERROR(ROUND((W21-W23-W102)*(W$3/(1-POWER(1+W$3,-W22))-1/W22),0),0)","v":2300.0},null,{"$f":"IFERROR(ROUND((Y21-Y23-Y102)*(Y$3/(1-POWER(1+Y$3,-Y22))-1/Y22),0),0)","v":1637.0},null,{"$f":"IFERROR(ROUND((AA21-AA23-AA102)*(AA$3/(1-POWER(1+AA$3,-AA22))-1/AA22),0),0)","v":2300.0},null,{"$f":"IFERROR(ROUND((AC21-AC23-AC102)*(AC$3/(1-POWER(1+AC$3,-AC22))-1/AC22),0),0)","v":2300.0},null,{"$f":"IFERROR(ROUND((AE21-AE23-AE102)*(AE$3/(1-POWER(1+AE$3,-AE22))-1/AE22),0),0)","v":527.0},null,{"$f":"IFERROR(ROUND((AG21-AG23-AG90*AG102)*(AG$3/(1-POWER(1+AG$3,-AG22))-1/AG22),0),0)","v":527.0},null,{"$f":"IFERROR(ROUND((AI21-AI23-AI90*AI102)*(AI$3/(1-POWER(1+AI$3,-AI22))-1/AI22),0),0)","v":2300.0}]
[null,"Pago de alquiler o leasing anual (€)",null,null,null,null,null,null,null,null,null,null,null,null,0.0,null,null,null,null,null,null,null,null,null,0.0,null,null,null,null,null,null,null,null,null,0.0]
[null,"Precio de tarifa sin IVA (€)",null,null,null,null,null,null,null,null,null,null,null,null,8705.35,null,null,null,null,null,null,null,null,null,44519.11,null,null,null,null,null,null,null,null,null,0.0]
[null,"Descuento sobre tarifa (%)",null,null,null,null,null,null,null,null,null,null,null,null,5.0,null,null,null,null,null,null,null,null,null,5.0,null,null,null,null,null,null,null,null,null,0.0]
[null,"Precio de adquisición sin IVA (€)",null,null,null,null,null,null,null,null,null,null,null,null,{"$f":"ROUND((1-O28/100)*O27,0)","v":8270.0},null,null,null,null,null,null,null,null,null,{"$f":"ROUND((1-Y28/100)*Y27,0)","v":42293.0},null,null,null,null,null,null,null,null,null,0.0]
[null,"Vida útil (años)",null,null,null,null,null,null,null,null,null,null,null,null,10.0,null,null,null,null,null,null,null,null,null,10.0,null,null,null,null,null,null,null,null,null,0.0]
{"$rows_left_out":96}
{"sheet":"Tipo Vehículo","index":2,"n_rows":12,"n_cols":6,"rows_kept":12,"cut":false,"hidden":false,"merged":[]}
[]
[]
[]
[]
[]
[null,null,"Seleccionar tipo de vehículo"]
[]
[]
[]
[null,null,"Tipo de vehículo:",null,{"$f":"VLOOKUP(F10,T!A2:B17,2,0)","v":"T1"},"Vehículo articulado de carga general de larga distancia"]
[]
[null,null,"¿Desea comenzar la simulación con los datos estadísticos añadidos a los formularios de cálculo?"]

{"sheet":"Cálculo Simplificado","index":3,"n_rows":52,"n_cols":11,"rows_kept":52,"cut":false,"hidden":false,"merged":[]}
[]
[]
[]
[]
[]
[null,null,"1. Cálculo simplificado"]
[]
[]
[null,null,"Introduzca un resumen simplificado de los parámetros de la simulación",null,null,null,null,null,null,"Datos estadísticos",{"$f":"DE!$AJ$2","v":"19/06/2025"}]
[null,null,null,null,null,null,null,null,{"$f":"J10","v":5.6099999999999997E-2},{"$f":"IF(HLOOKUP('Tipo Vehículo'!$E$10,DE!$D$1:$AT$285,3,0)=\"\",\"\",HLOOKUP('Tipo Vehículo'!$E$10,DE!$D$1:$AT$285,3,0))","v":5.6099999999999997E-2}]
[null,null,"Kilómetros recorridos anualmente",null,null,null,null,null,null,{"$f":"IF(HLOOKUP('Tipo Vehículo'!$E$10,DE!$D$1:$SS$300,9,0)=\"\",\"\",HLOOKUP('Tipo Vehículo'!$E$10,DE!$D$1:$AI$300,9,0))","v":150000}]
[]
[null,null,"Horas trabajadas al año",null,null,null,null,null,null,{"$f":"IF(HLOOKUP('Tipo Vehículo'!$E$10,DE!$D$1:$AI$300,13,0)=\"\",\"\",HLOOKUP('Tipo Vehículo'!$E$10,DE!$D$1:$AI$300,13,0))","v":2000}]
[]
[null,null,"Valor de adquisición del vehículo sin IVA y sin neumáticos (€)",null,null,null,null,null,null,{"$f":"IF(HLOOKUP('Tipo Vehículo'!$E$10,DE!$D$1:$AI$300,121,0)=\"\",\"\",HLOOKUP('Tipo Vehículo'!$E$10,DE!$D$1:$AI$300,121,0))","v":106861}]
[]
[null,null,"Vida útil del vehículo (años)",null,null,null,null,null,null,{"$f":"IF(HLOOKUP('Tipo Vehículo'!$E$10,DE!$D$1:$AI$300,17,0)=\"\",\"\",HLOOKUP('Tipo Vehículo'!$E$10,DE!$D$1:$AI$300,22,0))","v":5}]
[]
[null,null,"Valor residual sin IVA del vehículo (€)",null,null,null,null,null,null,{"$f":"IF(HLOOKUP('Tipo Vehículo'!$E$10,DE!$D$1:$AI$300,23,0)=\"\",\"\",HLOOKUP('Tipo Vehículo'!$E$10,DE!$D$1:$AI$300,23,0))","v":19236}]
[]
[null,null,"Valor de adquisición del remolque-semirremolque sin IVA y sin neumáticos (€)",null,null,null,null,null,null,{"$f":"IF(HLOOKUP('Tipo Vehículo'!$E$10,DE!$D$1:$AI$300,122,0)=\"\",\"\",HLOOKUP('Tipo Vehículo'!$E$10,DE!$D$1:$AI$300,122,0))","v":33602.04}]
[]
[null,null,"Vida útil del remolque-semirremolque (años)",null,null,null,null,null,null,{"$f":"IF(HLOOKUP('Tipo Vehículo'!$E$10,DE!$D$1:$AI$300,38,0)=\"\",\"\",HLOOKUP('Tipo Vehículo'!$E$10,DE!$D$1:$AI$300,38,0))","v":7}]
[]
[null,null,"Valor residual del remolque-semirremolque sin IVA (€)",null,null,null,null,null,null,{"$f":"IF(HLOOKUP('Tipo Vehículo'!$E$10,DE!$D$1:$AI$300,39,0)=\"\",\"\",HLOOKUP('Tipo Vehículo'!$E$10,DE!$D$1:$AI$300,39,0))","v":3987}]
[]
[null,null,"Leasing y alquiler (vehículo de tracción, carrozado, semirremolque, equipos auxiliares)",null,null,null,null,null,null,{"$f":"IF(HLOOKUP('Tipo Vehículo'!$E$10,DE!$D$1:$AI$300,18,0)=\"\",\"\",HLOOKUP('Tipo Vehículo'!$E$10,DE!$D$1:$AI$300,18,0))","v":0}]
[]
[null,null,"Coste total anual del conductor, incluidos costes de empresa, Seg. Soc y otros (€)",null,null,null,null,null,null,{"$f":"IF(HLOOKUP('Tipo Vehículo'!$E$10,DE!$D$1:$AI$300,51,0)=\"\",\"\",HLOOKUP('Tipo Vehículo'!$E$10,DE!$D$1:$AI$300,51,0))","v":37649.699999999997}]
[]
{"$rows_left_out":23}
{"sheet":"Resultados","index":4,"n_rows":67,"n_cols":9,"rows_kept":67,"cut":false,"hidden":false,"merged":[[58,4,58,5],[8,4,8,5],[35,4,35,5]]}
[]
[]
[]
[]
[]
[null,null,"Resultados"]
[]
[]
[null,null,"ESTRUCTURA DE COSTES ANUALES",null,"Usuario",null,null,"Datos estadísticos",{"$f":"DE!$AJ$2","v":"19/06/2025"}]
[null,null,null,null,"Euros","%",null,"Euros","%"]
[null,null,"Amortización y gastos financieros y leasing","A",{"$f":"ROUND(('Cálculo Simplificado'!I15-'Cálculo Simplificado'!I19)*(1/'Cálculo Simplificado'!I17)+('Cálculo Simplificado'!I15-'Cálculo Simplificado'!I19)*(-(1/'Cálculo Simplificado'!I17)+'Cálculo Simplificado'!I$10/(1-POWER(1+'Cálculo Simplificado'!I$10,-'Cálculo Simplificado'!I17)))+IFERROR(('Cálculo Simplificado'!I21-'Cálculo Simplificado'!I25)*(1/'Cálculo Simplificado'!I23)+('Cálculo Simplificado'!I21-'Cálculo Simplificado'!I25)*(-(1/'Cálculo Simplificado'!I23)+'Cálculo Simplificado'!I$10/(1-POWER(1+'Cálculo Simplificado'!I$10,-'Cálculo Simplificado'!I23))),0)+'Cálculo Simplificado'!I27 + IF(HLOOKUP('Tipo Vehículo'!$E$10,DE!$D$1:$AI$300,17,0)=\"\",\"\",HLOOKUP('Tipo Vehículo'!$E$10,DE!$D$1:$AI$300,32,0))+IFERROR(IF(HLOOKUP('Tipo Vehículo'!$E$10,DE!$D$1:$AI$300,17,0)=\"\",\"\",HLOOKUP('Tipo Vehículo'!$E$10,DE!$D$1:$AI$300,33,0)),0),0)","v":{"$error":"#DIV/0!"}},{"$f":"IFERROR(E11*F$16/E$16,0)","v":0},"A",{"$f":"ROUND(('Cálculo Simplificado'!J15-'Cálculo Simplificado'!J19)*(1/'Cálculo Simplificado'!J17)+('Cálculo Simplificado'!J15-'Cálculo Simplificado'!J19)*(-(1/'Cálculo Simplificado'!J17)+'Cálculo Simplificado'!J$10/(1-POWER(1+'Cálculo Simplificado'!J$10,-'Cálculo Simplificado'!J17)))+IFERROR(('Cálculo Simplificado'!J21-'Cálculo Simplificado'!J25)*(1/'Cálculo Simplificado'!J23)+('Cálculo Simplificado'!J21-'Cálculo Simplificado'!J25)*(-(1/'Cálculo Simplificado'!J23)+'Cálculo Simplificado'!J$10/(1-POWER(1+'Cálculo Simplificado'!J$10,-'Cálculo Simplificado'!J23))),0)+'Cálculo Simplificado'!J27 + IF(HLOOKUP('Tipo Vehículo'!$E$10,DE!$D$1:$AI$300,17,0)=\"\",\"\",HLOOKUP('Tipo Vehículo'!$E$10,DE!$D$1:$AI$300,32,0))+IFERROR(IF(HLOOKUP('Tipo Vehículo'!$E$10,DE!$D$1:$AI$300,17,0)=\"\",\"\",HLOOKUP('Tipo Vehículo'!$E$10,DE!$D$1:$AI$300,33,0)),0),0)","v":25813},{"$f":"IFERROR(H11*I$16/H$16,0)","v":10.700310069807159}]
[null,null,"Personal","B",{"$f":"ROUND('Cálculo Simplificado'!I29+'Cálculo Simplificado'!I31,0)","v":0},{"$f":"IFERROR(E12*F$16/E$16,0)","v":0},"B",{"$f":"ROUND('Cálculo Simplificado'!J29+'Cálculo Simplificado'!J31,0)","v":68300},{"$f":"IFERROR(H12*I$16/H$16,0)","v":28.312523835580095}]
[null,null,"Seguros, costes fiscales, gestión y comercialización","C",{"$f":"ROUND(IFERROR('Cálculo Simplificado'!I33+'Cálculo Simplificado'!I35+'Cálculo Simplificado'!I49,0),0)","v":0},{"$f":"IFERROR(E13*F$16/E$16,0)","v":0},"C",{"$f":"ROUND(IFERROR('Cálculo Simplificado'!J33+'Cálculo Simplificado'!J35+'Cálculo Simplificado'!J49,0),0)","v":22618},{"$f":"IFERROR(H13*I$16/H$16,0)","v":9.3758808801339768}]
[null,null,"Carburante, neumáticos, reparaciones, mantenimiento y peajes","D",{"$f":"ROUND(IFERROR('Cálculo Simplificado'!I39+'Cálculo Simplificado'!I41+'Cálculo Simplificado'!I43+'Cálculo Simplificado'!I45+'Cálculo Simplificado'!I47,0),0)","v":0},{"$f":"IFERROR(E14*F$16/E$16,0)","v":0},"D",{"$f":"ROUND(IFERROR('Cálculo Simplificado'!J39+'Cálculo Simplificado'!J41+'Cálculo Simplificado'!J43+'Cálculo Simplificado'!J45+'Cálculo Simplificado'!J47,0),0)","v":124505},{"$f":"IFERROR(H14*I$16/H$16,0)","v":51.611285214478769}]
[]
[null,null,"COSTES TOTALES",null,{"$f":"ROUND(SUM(E11:E14),0)","v":{"$error":"#DIV/0!"}},100,null,{"$f":"ROUND(SUM(H11:H14),0)","v":241236},100]
[]
[]
[]
[]
[]
[]
[]
[]
[]
[]
[]
[]
[]
[]
{"$rows_left_out":38}
{"sheet":"Coste Servicio","index":5,"n_rows":37,"n_cols":8,"rows_kept":37,"cut":false,"hidden":false,"merged":[[10,7,10,10]]}
[]
[]
[]
[]
[]
[null,null,"Coste de un servicio"]
[]
[]
[null,null,"Coste de un servicio"]
[]
[null,null,"Denominación del servicio"]
[]
[null,null,"Kilómetros recorridos en este servicio (km)",null,null,null,null,{"$f":"H15+H17","v":0}]
[]
[null,null,"Kilómetros en carga (km) "]
[]
[null,null,"Kilómetros en vacío (km) "]
[]
[null,null,"Consumo medio por kilómetro en este servicio (litros / 100 km) "]
[]
[null,null,"Horas empleadas en este servicio ",null,null,null,null,{"$f":"H23+H25+H27","v":0}]
[]
[null,null,"Horas en carga "]
[]
[null,null,"Horas en vacío "]
[null,null,null,null,null,null,null,6]
[null,null,"Horas en carga, descarga y paralización "]
[]
[null,null,"Peajes "]
[]
{"$rows_left_out":7}