{"text_format":"1","workbook":"xlsx","n_sheets":9,"sheets":["ELE GALDETEGIA","ETXEBIZITZA","Datos para Fórmulas","ESPAZIO PUBLIKO IREKIAK","OINARRIZKO EKIPAMENDUAK","J. EKONOMIKOA","J. SOZIOKULTURALA","HIZKUNTZA FUNTSEZKO ALDERDIAK","NEURRI ZUZENTZAILEAK"],"not_rendered":{"charts":0,"images":28,"macros":1,"external_links":1,"defined_names":2,"comments":0,"pivot_tables":0},"unopened":[],"bounds":{"document_bytes":16777216,"sheet_cells":100000,"rows_first":2000,"rows_last":500,"rows_between":2000,"halvings":0,"cell_chars":16384,"cell_head_chars":4096},"cells_cut":0,"cells_raw":0,"read":"whole","date_system":"1900"}

{"sheet":"ELE GALDETEGIA","index":0,"n_rows":69,"n_cols":6,"rows_kept":69,"cut":false,"hidden":false,"merged":[[53,0,53,5],[0,0,0,5],[3,0,3,5],[13,0,13,5],[23,0,23,5],[33,0,33,5],[43,0,43,5]]}
["Kultura eta Hizkuntza Politika Saila"]
[]
[null,"BAI/EZ","+ -","INTENTSITATEA","BALIOA","AZALPENA"]
["1. Komunitatearen kultur eta gizarte bizitzan \n(harreman sareak aldatzea, harreman ohiturak aldatzea, kultur espresioak aldatzea, elkargune berriak sortzea, kultur agenda aldatzea)"]
["1.1 Eragina proiektua egiten ari den artean"]
["1.1.1. Eragin mugatua: eragina proiektua/plana garatuko den lekuan soilik nabarituko da.",null,1,null,{"$f":"IF(D6='Datos para Fórmulas'!$A$18,'Datos para Fórmulas'!$B$18,IF(D6='Datos para Fórmulas'!$A$19,'Datos para Fórmulas'!$B$19,IF(D6='Datos para Fórmulas'!$A$20,'Datos para Fórmulas'!$B$20,0)))/'Datos para Fórmulas'!$E$29*C6","v":0}]
["1.1.2. Eragin hedatua: eragina inguruko eremuetara ere hedatuko da",null,1,null,{"$f":"IF(D7='Datos para Fórmulas'!$A$18,'Datos para Fórmulas'!$B$18,IF(D7='Datos para Fórmulas'!$A$19,'Datos para Fórmulas'!$B$19,IF(D7='Datos para Fórmulas'!$A$20,'Datos para Fórmulas'!$B$20,0)))*'Datos para Fórmulas'!$E$30*C7","v":0}]
["1.2. Eragina proiektua egin eta gero."]
["1.2.1. Eragin mugatua: eragina proiektua/plana garatuko den lekuan soilik nabarituko da.",null,1,null,{"$f":"IF(D9='Datos para Fórmulas'!$A$18,'Datos para Fórmulas'!$B$18,IF(D9='Datos para Fórmulas'!$A$19,'Datos para Fórmulas'!$B$19,IF(D9='Datos para Fórmulas'!$A$20,'Datos para Fórmulas'!$B$20,0)))*'Datos para Fórmulas'!$E$33*C9","v":0}]
["1.2.2. Eragin hedatua: eragina inguruko eremuetara ere hedatuko da.",null,1,null,{"$f":"IF(D10='Datos para Fórmulas'!$A$18,'Datos para Fórmulas'!$B$18,IF(D10='Datos para Fórmulas'!$A$19,'Datos para Fórmulas'!$B$19,IF(D10='Datos para Fórmulas'!$A$20,'Datos para Fórmulas'!$B$20,0)))*'Datos para Fórmulas'!$E$34*C10","v":0}]
["1.3.Eragina noizbehinkakoa izango da.",null,-1,null,{"$f":"IF(D11='Datos para Fórmulas'!$A$18,'Datos para Fórmulas'!$B$18,IF(D11='Datos para Fórmulas'!$A$19,'Datos para Fórmulas'!$B$19,IF(D11='Datos para Fórmulas'!$A$20,'Datos para Fórmulas'!$B$20,0)))*'Datos para Fórmulas'!$E$36*C11","v":0}]
["1.4. Eragina etengabekoa izango da.",null,1,null,{"$f":"IF(D12='Datos para Fórmulas'!$A$18,'Datos para Fórmulas'!$B$18,IF(D12='Datos para Fórmulas'!$A$19,'Datos para Fórmulas'!$B$19,IF(D12='Datos para Fórmulas'!$A$20,'Datos para Fórmulas'!$B$20,0)))*'Datos para Fórmulas'!$E$38*C12","v":0}]
[null,null,null,null,{"$f":"SUM(E6:E12)","v":0},{"$f":"LOOKUP(SUM(E6:E12),'Datos para Fórmulas'!C46:D49,'Datos para Fórmulas'!A46:A49)","v":"ERAGIN POSITIBOA"}]
["2. Tokiko euskararen ezagutzan"]
["2.1 Eragina proiektua egiten ari den artean nabarituko da?"]
["2.1.1. Eragin mugatua: eragina proiektua/plana garatuko den lekuan soilik nabarituko da.",null,1,null,{"$f":"IF(D16='Datos para Fórmulas'!$A$18,'Datos para Fórmulas'!$B$18,IF(D16='Datos para Fórmulas'!$A$19,'Datos para Fórmulas'!$B$19,IF(D16='Datos para Fórmulas'!$A$20,'Datos para Fórmulas'!$B$20,0)))/'Datos para Fórmulas'!$E$29*C16","v":0}]
["2.1.2. Eragin hedatua: eragina inguruko eremuetara ere hedatuko da.",null,1,null,{"$f":"IF(D17='Datos para Fórmulas'!$A$18,'Datos para Fórmulas'!$B$18,IF(D17='Datos para Fórmulas'!$A$19,'Datos para Fórmulas'!$B$19,IF(D17='Datos para Fórmulas'!$A$20,'Datos para Fórmulas'!$B$20,0)))*'Datos para Fórmulas'!$E$30*C17","v":0}]
["2.2. Eragina proiektua egin eta gero ere nabarituko da?"]
["2.2.1. Eragin mugatua: eragina proiektua/plana garatuko den lekuan soilik nabarituko da.",null,-1,null,{"$f":"IF(D19='Datos para Fórmulas'!$A$18,'Datos para Fórmulas'!$B$18,IF(D19='Datos para Fórmulas'!$A$19,'Datos para Fórmulas'!$B$19,IF(D19='Datos para Fórmulas'!$A$20,'Datos para Fórmulas'!$B$20,0)))*'Datos para Fórmulas'!$E$33*C19","v":0}]
["2.2.2. Eragin hedatua: eragina inguruko eremuetara ere hedatuko da.",null,1,null,{"$f":"IF(D20='Datos para Fórmulas'!$A$18,'Datos para Fórmulas'!$B$18,IF(D20='Datos para Fórmulas'!$A$19,'Datos para Fórmulas'!$B$19,IF(D20='Datos para Fórmulas'!$A$20,'Datos para Fórmulas'!$B$20,0)))*'Datos para Fórmulas'!$E$34*C20","v":0}]
["2.3.Eragina noizbehinkakoa izango da.",null,1,null,{"$f":"IF(D21='Datos para Fórmulas'!$A$18,'Datos para Fórmulas'!$B$18,IF(D21='Datos para Fórmulas'!$A$19,'Datos para Fórmulas'!$B$19,IF(D21='Datos para Fórmulas'!$A$20,'Datos para Fórmulas'!$B$20,0)))*'Datos para Fórmulas'!$E$36*C21","v":0}]
["2.4. Eragina etengabekoa izango da.",null,1,null,{"$f":"IF(D22='Datos para Fórmulas'!$A$18,'Datos para Fórmulas'!$B$18,IF(D22='Datos para Fórmulas'!$A$19,'Datos para Fórmulas'!$B$19,IF(D22='Datos para Fórmulas'!$A$20,'Datos para Fórmulas'!$B$20,0)))*'Datos para Fórmulas'!$E$38*C22","v":0}]
[null,null,null,null,{"$f":"SUM(E16:E22)*2","v":0},{"$f":"LOOKUP(E23,'Datos para Fórmulas'!C68:D71,'Datos para Fórmulas'!A68:A71)","v":"ERAGIN POSITIBOA"}]
["3. Tokiko euskararen erabileran"]
["3.1 Eragina proiektua egiten ari den artean nabarituko da?"]
["3.1.1. Eragin mugatua: eragina proiektua/plana garatuko den lekuan soilik nabarituko da.",null,1,null,{"$f":"IF(D26='Datos para Fórmulas'!$A$18,'Datos para Fórmulas'!$B$18,IF(D26='Datos para Fórmulas'!$A$19,'Datos para Fórmulas'!$B$19,IF(D26='Datos para Fórmulas'!$A$20,'Datos para Fórmulas'!$B$20,0)))/'Datos para Fórmulas'!$E$29*C26","v":0}]
["3.1.2. Eragin hedatua: eragina inguruko eremuetara ere hedatuko da.",null,1,null,{"$f":"IF(D27='Datos para Fórmulas'!$A$18,'Datos para Fórmulas'!$B$18,IF(D27='Datos para Fórmulas'!$A$19,'Datos para Fórmulas'!$B$19,IF(D27='Datos para Fórmulas'!$A$20,'Datos para Fórmulas'!$B$20,0)))*'Datos para Fórmulas'!$E$30*C27","v":0}]
["3.2. Eragina proiektua egin eta gero ere nabarituko da?"]
["3.2.1. Eragin mugatua: eragina proiektua/plana garatuko den lekuan soilik nabarituko da.",null,1,null,{"$f":"IF(D29='Datos para Fórmulas'!$A$18,'Datos para Fórmulas'!$B$18,IF(D29='Datos para Fórmulas'!$A$19,'Datos para Fórmulas'!$B$19,IF(D29='Datos para Fórmulas'!$A$20,'Datos para Fórmulas'!$B$20,0)))*'Datos para Fórmulas'!$E$33*C29","v":0}]
["3.2.2. Eragin hedatua: eragina inguruko eremuetara ere hedatuko da.",null,1,null,{"$f":"IF(D30='Datos para Fórmulas'!$A$18,'Datos para Fórmulas'!$B$18,IF(D30='Datos para Fórmulas'!$A$19,'Datos para Fórmulas'!$B$19,IF(D30='Datos para Fórmulas'!$A$20,'Datos para Fórmulas'!$B$20,0)))*'Datos para Fórmulas'!$E$34*C30","v":0}]
{"$rows_left_out":40}
{"sheet":"ETXEBIZITZA","index":1,"n_rows":61,"n_cols":7,"rows_kept":61,"cut":false,"hidden":false,"merged":[[0,0,0,6],[8,2,8,6],[17,2,17,6],[26,2,26,6],[11,6,13,6],[2,0,2,6],[6,0,6,6],[15,0,15,6],[24,0,24,6],[4,0,4,6]]}
["Kultura eta Hizkuntza Politika Saila"]
[]
["ETXEBIZITZA"]
[]
["Etxebizitzak eraikiko diren kasuetan betetzekoa"]
[]
["IZAERA"]
[]
[null,"FUNTSEZKO ALDERDIAK","BALORAZIOA"]
[null,null,"Bai","Ez","Ez dagokio","Azalpena","Eraginak hizkuntzan"]
[1,"Etxebizitzen batez besteko kostua herritarren beharretara egokitutakoak al dira?",null,null,null,null,"Euskararen ezagutza-tasa horrenbeste ez jaistea lortzen da, herrikoak bertan geratzeko aukera sustatuta, hazkuntza txikiagoa izango litzatekeelako."]
[2,"Etxebizitzetatik oinarrizko zerbitzu eta ekipamenduak aise iristeko moduan egotea sustatzen al du?",null,null,null,null,"Komunitatearen gizarte bizitza aberasten du eta, ondorioz, erabilera areagotzen du"]
[3,"Elkarbizitzarako espazio irekiak aurreikusten al dira etxebizitzetatik gertu?"]
[4,"Etxebizitza-eraikin berrietan, bizilagunek elkar ezagutzeko eta elkarrekin harremanetan jartzeko, atari bakoitzeko bizilagun-kopurua zaintzea edo mugatzea aurreikusi al da?"]
[]
["DIMENTSIOA"]
[]
[null,"FUNTSEZKO ALDERDIAK","BALORAZIOA"]
[null,null,"Bai","Ez","Ez dagokio","Azalpena","Eraginak hizkuntzan"]
[5,"Herriaren hazkuntza jasangarria izatea jasotzen al da helburuen artean?",null,null,null,null,"Euskararen ezagutza-tasa horrenbeste ez jaistea lortzen da, herrikoak bertan geratzeko aukera sustatuta, hazkuntza txikiagoa izango litzatekeelako.\n"]
[6,"Etxebizitzak eskuratzeko lehentasuna herritarrek izateko neurriak hartzea proposatzen al da?"]
[7,"Etxebizitzen eraikuntza denboran luzatzeko neurriak jasotzen al dira?",null,null,null,null,"Jende etorrera asimilatzeko aukera lortzen da"]
[]
[]
["LEKUKOTZEA"]
[]
[null,"FUNTSEZKO ALDERDIAK","BALORAZIOA"]
[null,null,"Bai","Ez","Ez dagokio","Azalpena","Eraginak hizkuntzan"]
[8,"Etxebizitzak herriko eremu ezberdinetan egitea aurreikusten al da?",null,null,null,null,"Eraginaren intentsitatea baxuagoa izatea lortzen da"]
[]
{"$rows_left_out":32}
{"sheet":"Datos para Fórmulas","index":2,"n_rows":79,"n_cols":5,"rows_kept":79,"cut":false,"hidden":true,"merged":[]}
[]
[]
["Posibles valores de la columna BAI/EZ de la hoja \"ELE GALDETEGIA\" "]
["Columna B"]
[]
["BAI"]
["EZ"]
[]
["Posibles valores de la columna +/- de la hoja \"ELE GALDETEGIA\""]
[" Columna C"]
[]
["+"]
["-"]
[]
["Posibles valores de la columna INTENTSITATEA de la hoja \"ELE GALDETEGIA\""]
["Columna D"]
[null,0]
["BAXUA",1]
["ERTAINA",2]
["HANDIA",4]
[]
[]
["Cálculos para obtener el valor de la columna BALIOAk"]
["En función del valor de la columna C el valor de la Columna E debe ser POSITIVO o NEGATIVO"]
["Si COLUMNA C es + la COLUMNA E debe ser -"]
["Si COLUMNA C es - la COLUMNA E debe ser +"]
["Columna E"]
["1.1               Proiektua egiten ari den artean:"]
["1.1.1 Eragina mugatua","INTENTSITATEA /2 ",null,"DIVIDIR",2]
["1.1.2 Eragina hedatua","INTENTSITATEA X1",null,"MULTIPLICAR",1]
{"$rows_left_out":50}
{"sheet":"ESPAZIO PUBLIKO IREKIAK","index":3,"n_rows":30,"n_cols":7,"rows_kept":30,"cut":false,"hidden":false,"merged":[[28,6,29,6],[0,0,0,6],[8,2,8,6],[10,6,12,6],[18,2,18,6],[25,2,25,6],[2,0,2,6],[6,0,6,6],[16,0,16,6],[23,0,23,6],[4,0,4,6]]}
["Kultura eta Hizkuntza Politika Saila"]
[]
["ESPAZIO PUBLIKO IREKIAK"]
[]
["Eraberritu edo berriak eraikiko diren kasuetan betetzekoa"]
[]
["IZAERA"]
[]
[null,"FUNTSEZKO ALDERDIAK","BALORAZIOA"]
[null,null,"Bai","Ez","Ez dagokio","Azalpena","Eraginak hizkuntzan"]
[9,"Espazio publiko irekiak erakargarriak, aise iristeko modukoak eta erabiltzeko modukoak bultzatzen al dira?",null,null,null,null,"Gizarte kohesioa eta kultur bizitza areagotzen du eta ondorioz, erabilera areagotzen du"]
[10,"Oinezko sareak aurreikusi al dira?"]
[11,"Espazio publikoen arteko harremana egotea kontuan hartu al da?"]
[12,"Espazio publiko irekiei askotariko erabilera ematea aurreikusten al da?",null,null,null,null,"Ezaugarri ezberdinetako pertsonak elkarrekin egotea sustatzen du eta gizarte kohesio eta elkarbizitza hobetzen du, erabilera areagotuz"]
[13,"Espazio publikoetan adin nahasketa ematea aurreikusten al da? Haur zein helduek erabili ahal izateko guneak egotea?",null,null,null,null,"Gizarte kohesioa sustatzeaz gain, hizkuntzaren zein kulturaren transmisioa ematea sustatzen du"]
[]
["DIMENTSIOA"]
[]
[null,"FUNTSEZKO ALDERDIAK","BALORAZIOA"]
[null,null,"Bai","Ez","Ez dagokio","Azalpena","Eraginak hizkuntzan"]
[14,"Tokiko beharretara neurriratutako espazio publikoak aurreikusi al dira",null,null,null,null,"Erabiltzaileen hazkuntza jasangarria izaten laguntzen du eta, ondorioz, erabilerari modu xumeagoan eragiten dio"]
[]
[]
["LEKUKOTZEA"]
[]
[null,"FUNTSEZKO ALDERDIAK","BALORAZIOA"]
[null,null,"Bai","Ez","Ez dagokio","Azalpena","Eraginak hizkuntzan"]
[15,"Ekimenak garrantzi naturala, historikoa edota kulturala duten lekuak babesten edo hobetzen al ditu?",null,null,null,null,"Bertako ondarea zaintzen du, bertako kultura, hizkuntza, natura, historia aintzat hartuta"]
[16,"Espazio publiko irekiak beste instalazio batzuk ditu inguruan, adibidez, dendak, liburutegia, kultur etxea, ikastetxeak eta gizarte kohesioa sustatzeko komunitate-zentroak?",null,null,null,null,"Gizarte kohesioa eta kultur bizitza areagotzen du eta, ondorioz, erabilera areagotzen du"]
[17,"Espazio publiko irekiak eremu askotan dispertsatzea aurreikusten al da?"]
{"$rows_left_out":1}
{"sheet":"OINARRIZKO EKIPAMENDUAK","index":4,"n_rows":25,"n_cols":7,"rows_kept":25,"cut":false,"hidden":false,"merged":[[8,2,8,6],[16,2,16,6],[22,2,22,6],[0,0,0,6],[6,0,6,6],[14,0,14,6],[20,0,20,6],[2,0,2,6],[4,0,4,6]]}
["Kultura eta Hizkuntza Politika Saila"]
[]
["OINARRIZKO EKIPAMENDUAK"]
[]
["Eraberritu edo berriak eraikiko diren kasuetan betetzekoa"]
[]
["IZAERA"]
[]
[null,"FUNTSEZKO ALDERDIAK","BALORAZIOA"]
[null,null,"Bai","Ez","Ez dagokio","Azalpena","Eraginak hizkuntzan"]
[18,"Ekimenak hezkuntzarekin, osasunarekin, gizarte-zerbitzuekin, kirolarekin edo kulturarekin lotutako oinarrizko ekipamenduen erabilera sustatzen al du?",null,null,null,null,"Gizarte bizitza eta kultur bizitza sustatzen du. Herritarren integrazioa ahalbidetzen dute."]
[19,"Kultura, kirola, hezkuntza zerbitzuak eskaintzen dituen eraikinen kudeaketa publikoa izango al da?",null,null,null,null,"Udalaren hizkuntza irizpideak ezartzen dira"]
[20,"Pribatua izanez gero udalarekin hitzarmenak egitea aurreikusten al da?",null,null,null,null,"Udalarekin hizkuntza irizpideak adosten dira"]
[]
["DIMENTSIOA"]
[]
[null,"FUNTSEZKO ALDERDIAK","BALORAZIOA"]
[null,null,"Bai","Ez","Ez dagokio","Azalpena","Eraginak hizkuntzan"]
[21,"Tokiko beharretara neurriratutako ekipamenduak aurreikusi al dira?",null,null,null,null,"Erabiltzaileen hazkuntza jasangarria izaten laguntzen du eta, ondorioz, erabilera zein ezagutza tasari modu xumeagoa eragiten dio"]
[]
["LEKUKOTZEA"]
[]
[null,"FUNTSEZKO ALDERDIAK","BALORAZIOA"]
[null,null,"Bai","Ez","Ez dagokio","Azalpena","Eraginak hizkuntzan"]
[22,"Ekipamenduak beste ekipamendu osagarri batzuetatik gertu daude eta denen koordinazioa, eraginkortasuna eta gizarte-kohesioa ahalbidetzen duen sarea osatzen dute?",null,null,null,null,"Ekipamenduen erabilera sustatzen du eta, ondorioz, gizarte integrazioa eta erabilera areagotzen du"]

{"sheet":"J. EKONOMIKOA","index":5,"n_rows":28,"n_cols":7,"rows_kept":28,"cut":false,"hidden":false,"merged":[[0,0,0,6],[8,2,8,6],[10,6,15,6],[19,2,19,6],[25,2,25,6],[6,0,6,6],[17,0,17,6],[23,0,23,6],[2,0,2,6],[4,0,4,6]]}
["Kultura eta Hizkuntza Politika Saila"]
[]
["JARDUERA EKONOMIKOA"]
[]
["Industriguneak, lanpostuak ugarituko direnean betetzeko:"]
[]
["IZAERA"]
[]
[null,"FUNTSEZKO ALDERDIAK","BALORAZIOA"]
[null,null,"Bai","Ez","Ez dagokio","Azalpena","Eraginak hizkuntzan"]
[23,"Ekimenak tokiko lan-aukerak sustatzen al ditu?",null,null,null,null,"Bertakoei lanean geratzeko aukera eskaintzen die, eta, ondorioz, langileen euskararen ezagutza eta erabilerari modu xumeagoan eragiten dio"]
[24,"Sortuko diren lanpostuak bertakoek betetzeko neurriak ezartzen al ditu helburuen artean?"]
[25,"Helburuen artean askotariko enpleguak lortzeko aukerak sustatzea al dago?"]
[26,"Herritar-talde guztientzako lan aukerak bultzatzen al ditu?"]
[27,"Helburuen artean, tokiko enpleguarekin lotutako prestakuntza sustatzea jasotzen al du?"]
[28,"Ekonomia aniztasun handiagoa egotea bultzatzen al du?"]
[]
["DIMENTSIOA"]
[]
[null,"FUNTSEZKO ALDERDIAK","BALORAZIOA"]
[null,null,"Bai","Ez","Ez dagokio","Azalpena","Eraginak hizkuntzan"]
[29,"Tokiko beharretara neurriratutako lanpostuak sustatuko al dira?",null,null,null,null,"Tokiko lan beharrei erantzuten die eta aldi berean kanpoko langile kopurua neurriratzeak ezagutza tasari positiboki eragiten dio"]
[]
["LEKUKOTZEA"]
[]
[null,"FUNTSEZKO ALDERDIAK","BALORAZIOA"]
[null,null,"Bai","Ez","Ez dagokio","Azalpena","Eraginak hizkuntzan"]
[30,"Enpresa berriak eraikiko badira euskararen hauskortasun txikiko gunean izatea aurreikusi al da?",null,null,null,null,"Eraginaren intentsitatea txikitzen du"]

{"sheet":"J. SOZIOKULTURALA","index":6,"n_rows":25,"n_cols":7,"rows_kept":25,"cut":false,"hidden":false,"merged":[[8,2,8,6],[16,2,16,6],[22,2,22,6],[0,0,0,6],[6,0,6,6],[14,0,14,6],[20,0,20,6],[2,0,2,6],[4,0,4,6]]}
["Kultura eta Hizkuntza Politika Saila"]
[]
["JARDUERA SOZIOKULTURALA"]
[]
["Kulturarekin, turismoarekin lotura duten ekimenak aurrera eramango diren kasuetan betetzekoa"]
[]
["IZAERA"]
[]
[null,"FUNTSEZKO ALDERDIAK","BALORAZIOA"]
[null,null,"Bai","Ez","Ez dagokio","Azalpena","Eraginak hizkuntzan"]
[31,"Bertako kultura, hizkuntza, ohiturak sustatzea jasoko al du helburuen artean?",null,null,null,null,"Bertako kultura, hizkuntza eta ohiturak sustatzen ditu eta prestigiatzen ditu"]
[32,"Erabiliko diren irudi leloak bertako ezaugarriei lotutakoak izatea sustatuko al du?",null,null,null,null,"Bertako izaera indartzen, prestigiatzen du"]
[33,"Ekimenak bertako kultur sorkuntza sustatzea izango al du helburuen artean?",null,null,null,null,"Bertako kultur erreferenteak indartzen ditu"]
[]
["DIMENTSIOA"]
[]
[null,"FUNTSEZKO ALDERDIAK","BALORAZIOA"]
[null,null,"Bai","Ez","Ez dagokio","Azalpena","Eraginak hizkuntzan"]
[34,"Bisitari kopuru jasangarria jasotzea sustatuko al du?",null,null,null,null,"Erabilera eta ezagutza tasari modu xumeagoan eragiten dio"]
[]
["LEKUKOTZEA"]
[]
[null,"FUNTSEZKO ALDERDIAK","BALORAZIOA"]
[null,null,"Bai","Ez","Ez dagokio","Azalpena","Eraginak hizkuntzan"]
[35,"Jarduerak bisitariak hauskortasun txikiko gunean jasotzea aurreikusten al du?",null,null,null,null,"Intentsitate maila baxuagotzen laguntzen du"]

{"sheet":"HIZKUNTZA FUNTSEZKO ALDERDIAK","index":7,"n_rows":16,"n_cols":7,"rows_kept":16,"cut":false,"hidden":false,"merged":[[6,2,6,6],[8,6,9,6],[13,2,13,6],[0,0,0,6],[4,0,4,6],[11,0,11,6],[2,0,2,6],[1,1,1,6]]}
["Kultura eta Hizkuntza Politika Saila"]
[]
["HIZKUNTZARI LOTUTAKO FUNTSEZKO ALDERDIAK"]
[]
["HIZKUNTZA IRIZPIDEAK"]
[]
[null,"FUNTSEZKO ALDERDIAK","BALORAZIOA"]
[null,null,"Bai","Ez","Ez dagokio","Azalpena","Eraginak hizkuntzan"]
[36,"Jardueraren/proiektuaren exekuzio faserako hizkuntza irizpideak ezartzea aurreikusi al da? hizkuntza paisaiari lotutakoak, langileen euskara ezagutzari lotutakoak, komunikazio hizkuntzari lotutakoak, hizkuntzaren erabilerari lotutakoak…",null,null,null,null,"Egoera soziolinguistikoari kalterik egingo ez diola bermatzen da"]
[37,"Jardueraren/proiektua garatu eta gero inguru berri horretarako hizkuntza irizpideak ezartzea aurreikusi al da? \nhizkuntza paisaiari lotutakoak, toponimiari lotutakoak, komunikazio hizkuntzari lotutakoak, \nhizkuntzaren erabilera eta ezagutzari lotutakoak...\n"]
[]
["NEURRI OSAGARRIAK/ARINGARRIAK"]
[]
[null,"FUNTSEZKO ALDERDIAK","BALORAZIOA"]
[null,null,"Bai","Ez","Ez dagokio","Azalpena","Eraginak hizkuntzan"]
[38,"Kaltea murrizteko neurri osagarri edo aringarriak aurreikusi al dira? Etorri berriak euskalduntzeari begirakoak, etorri berrien integraziori begirakoak, euskara planak garatzeari begirakoak, ziurtagiriak eskaintzea, itzulpen zerbitzuak, irizpideak betetzen ez direnerako isunak...",null,null,null,null,"Proiektuaren/jardueraren eraginez sortutako kaltea murrizten da"]

{"sheet":"NEURRI ZUZENTZAILEAK","index":8,"n_rows":18,"n_cols":5,"rows_kept":18,"cut":false,"hidden":false,"merged":[[0,0,0,4]]}
["Kultura eta Hizkuntza Politika Saila"]
[]
["PROIEKTUAREN/JARDUERAREN IZAERARI LOTUTAKOAK","PROIEKTUAREN/JARDUERAREN DIMENTSIOARI LOTUTAKOAK","PROIEKTUAREN/JARDUERAREN LEKUKOTZEARI LOTUTAKOAK","HIZKUNTZA IRIZPIDEEI LOTUTAKOAK","NEURRI OSAGARRIAK/ARINGARRIAK"]
["Proiektuaren izaera eremu horretarako garapen sozioekonomiko eta soziokulturalera moldatzea. Adibidez, familia bakarreko edo dorre itxurako etxebizitzak beharrean, ingurura egokitutakoak egitea. ","Proiektuaren tamaina murriztea (Etxebizitzen kasuan, auzo/herri/eskualdearen beharretara neurriratzea hazkundea.)","Ezagutzan eragin kaltegarri txikiagoa izan dezan lekualdatzea","Etxebizitza eskuratzeko bertakoei lehentasuna ematea","Herritarren ahalduntze linguistikoa eta formazioa landu."]
["Biztanle berrien integraziorako egiturazko neurriak: auzo/etxebizitzen antolaketa eta egitura biztanle berrien integraziorako moldatu (bertako herritarrekin harremanak garatzeko espazioak, gune komunitarioak, etxebizitzen sarbidea oinezkoen espazioetatik, …)","Proiektuaren iraupena denbora luzatzea (etxebizitza guztiak aldi berean egin beharrean, fase desberdinetan egitea)","Proiektu guztia leku berean garatu ordez, eremu desberdinetan dispertsatzea","Herriko langileei lehentasuna ematea","Aisialdiko (kirol eta kultur) eskaintza  garatzea."]
["Ekimenak hezkuntzarekin, osasunarekin, gizarte-zerbitzuekin, kirolarekin edo kulturarekin lotutako oinarrizko ekipamenduen erabilera sustatzea","Proiektuaren tamaina murriztea","Erabileran eragin kaltegarri txikiagoa izan dezan lekualdatzea","Proiektuaren iragarkiak tokiko eta euskarazko hedabideetan egitea lehenetsi","Etorri berrientzat, integraziorako neurriak (hezkuntza,...) eta planak garatzea."]
["Kultura, kirola, hezkuntza zerbitzuak eskaintzen dituen eraikinen kudeaketa publikoa izatea","Proiektuaren iraupena denboran luzatzea. ","Proiektu guztia leku berean garatu ordez, eremu desberdinetan dispertsatzea","Kontratatutako langileak euskaldunak izatea"," Doako euskalduntzea bermatu."]
["Zerbitzuaren kudeaketa pribatua izanez gero udalarekin hitzarmenak egitea aurreikustea","Tokiko beharretara neurriratutako ekipamenduak aurreikusi","Ekipamenduak beste ekipamendu osagarri batzuetatik gertu egotea eta denen koordinazioa, eraginkortasuna eta gizarte-kohesioa ahalbidetzen duen sarea osatzea proposatu","Hizkuntza erabilerarako irizpideak finkatzea, euskarari lehentasuna emanez.","Euskalduntzeko konpromisoa bermatu"]
["Tokiko beharretara neurriratutako espazio publikoak aurreikustea","Ekimenak garrantzi naturala, historikoa edota kulturala duten lekuak babestea edo hobetzea","Enpresa berriak eraikiko badira euskararen hauskortasun txikiko guneetara bideratu","Euskara-planak edo ziurtagiria duten hornitzaileak lehenetsi","Etorri berrien euskalduntzea eta beharrezko errefortzua bermatu"]
["Ekimenak tokiko lan-aukerak sustatzea","Espazio publiko irekiak beste instalazio batzuk inguruan izatea, adibidez, dendak, liburutegia, kultur etxea, ikastetxeak eta gizarte kohesioa sustatzeko komunitate-zentroak","Jarduerak bisitariak hauskortasun txikiko guneetan jasotzea aurreikustea"," Lehen hitzetik euskaraz egitea.","Harrera-planak"]
["Sortuko diren lanpostuak bertakoek betetzeko neurriak ezartzea helburuen artean","Espazio publiko irekiak eremu askotan dispertsatzea aurreikustea",null,"Pasaia linguistikorako irizpideak finkatu, euskarari lehentasuna emanez eta erdarak beharrezkoa den kasuetan soilik erabiliz","Mintzapraktika programa garatua"]
["Helburuen artean askotariko enpleguak lortzeko aukerak sustatzea ","Tokiko beharretara neurriratutako lanpostuak sustatzea",null,"Bertako toponimia erabili","Ziurtagiria eskaini edo euskara-planak garatu"]
["Herritar-talde guztientzako lan aukerak bultzatzea","Bisitari kopuru jasangarria sustatzea: turismoa hizkuntz gutxituetako herrialdeetan sustatzea…",null,"Komunikazio irizpideak finkatu, euskarari lehentasuna emanez","Sentsibilizazio /motibazio kanpainak"]
["Helburuen artean, tokiko enpleguarekin lotutako prestakuntza sustatzea ",null,null,"Euskarazko eskaintza edo eskaintza elebiduna bermatu","Itzulpen zerbitzuak eskaini"]
["Ekonomia aniztasun handiagoa egotea bultzatzea",null,null,null,"Irizpideak betetzen ez direnerako isunak"]
["Bertako kultura, hizkuntza, ohiturak sustatzea helburuen artean"]
["Erabiliko diren irudi leloak bertako ezaugarriei lotutakoak izatea sustatzea"]
["Ekimenak bertako kultur sorkuntza sustatzea helburuen artean"]