{"text_format":"1","workbook":"xlsx","n_sheets":8,"sheets":["Datos","GALDETEGI LABURRA","Eremua aukeratu","Eremuaren Datuak","Eremuaren izena idatzi","Eremuaren Datuak B","HI","BHI"],"not_rendered":{"charts":0,"images":2,"macros":1,"external_links":0,"defined_names":4,"comments":1,"pivot_tables":0},"unopened":[],"bounds":{"document_bytes":16777216,"sheet_cells":100000,"rows_first":2000,"rows_last":500,"rows_between":2000,"halvings":0,"cell_chars":16384,"cell_head_chars":4096},"cells_cut":0,"cells_raw":0,"read":"whole","date_system":"1900"}

{"sheet":"Datos","index":0,"n_rows":1872,"n_cols":15,"rows_kept":1872,"cut":false,"hidden":true,"merged":[[0,0,1,0],[0,1,1,1],[3,0,4,4],[8,0,9,4],[30,0,31,4]]}
[null,"Guztira","Euskaldunak","Ama-hizkuntza euskara","Etxean erabiltzen den hizkuntza","ARABA%","BIZKAIA%","GIPUZKOA%","ESPAINIA% + NAFARROA%","ATZERRIKOAK%","ARABA","BIZKAIA","GIPUZKOA","ESPAINIA","ATZERRIKOAK"]
[null,null,"Guztira %","Guztira %","Guztira %"]
["Euskal AE / C.A. de Euskadi",2122895,42.203783041554104,18.397603209075537,14.491343189371117]
["Lurralde historikoak"]
[]
["Araba / Álava",314744,28.538431233002058,4.2409590940106021,2.9128434537274739]
["Bizkaia",1113955,36.613597497205902,12.41582052466795,9.2275720293907746]
["Gipuzkoa",694196,57.369964678563399,34.41714095537403,28.187572385896782]
["Eskualdeak"]
[]
["Arabako Ibarrak / Valles Alaveses",5826,19.756265018880878,2.6940562384239768,1.3731548232063164]
["Arabako Lautada / Llanada Alavesa",252606,27.702825744439956,3.7827158216000334,2.593366745049603]
["Arabako Mendialdea / Montaña Alavesa",2928,25.068306010928961,3.6120401337792645,2.7663934426229506]
["Arratia Nerbioi / Arratia-Nervión",23096,58.373744371319717,33.731845927173225,28.091444405957745]
["Bidasoa Beherea / Bajo Bidasoa",75092,45.77318489319768,20.141480604933616,15.132104618334843]
["Bilbo Handia / Gran Bilbao",838614,30.121963143949422,5.4420412522092736,3.5507396728411402]
["Debabarrena / Bajo Deba",53801,61.766509916172566,40.079645216761698,31.958513782271702]
["Debagoiena / Alto Deba",61179,66.254760620474357,45.525917668604187,37.277497180405042]
["Donostialdea / Donostia-San Sebastián",317836,49.202104229854385,23.676902471092763,18.030367862671316]
["Durangaldea / Duranguesado",95870,52.24679253155314,28.90747941561672,20.425576301241264]
["Enkartazioak / Encartaciones",31249,28.727319274216772,2.7368224182537948,2.2560721943102178]
["Errioxa Arabarra",11173,22.599122885527613,2.8469441058680132,1.718428354067842]
["Gernika-Bermeo",44570,73.596589634283148,55.372622660872985,43.94660085259143]
["Goierri",65645,63.415340086830682,41.55724828833101,35.193845685124529]
["Gorbeia Inguruak / Estribac. del Gorbea",8588,46.64648346530042,19.170162113139099,14.788076385654403]
["Kantauri Arabarra / Cantábrica Alavesa",33623,33.988638729441156,4.6643089053803344,2.9563096689765933]
["Markina-Ondarroa",25445,80.786009039103945,69.354342813220597,66.185891137748087]
["Plentzia-Mungia",55111,53.248897679229188,24.991618288013271,17.802253633575873]
["Tolosaldea / Tolosa",47285,73.818335624405208,54.973391686699955,49.174156709315852]
["Urola-Kostaldea / Urola Costa",73358,77.983314703236189,62.24720886805197,55.415905559039238]
["Udalerriak"]
[]
[null,null,null,null,null,"BIZTANLE/BISITARI BERRIEN JATORRIA PORTZENTAJETAN",null,null,null,null,"EUSKARAREN EZAGUTZA JATORRIAREN ARABERA"]
["Eremua aukeratu",0,0,0,0,0,0,0,0,0,0,0,0,0,0]
["Besterik",0,0,0,0,0,0,0,0,0,0,0,0,5,1]
["Abadiño",7527,55.96,32.602630530091673,23.297785069729287,0.48,68.87,5.3,19.350000000000001,5.99,28.5384312330021,36.613597497205902,57.369964678563399,5,1]
["Abaltzisketa",320,94.5,88.4375,89.967637540453069,0,0.64,94.59,1.59,3.18,28.5384312330021,36.613597497205902,57.369964678563399,5,1]
["Abanto y Ciervana-Abanto Zierbena",9564,30.46,2.2584692597239648,1.9762845849802373,0.25,80.33,0.46,15.55,3.4,28.5384312330021,36.613597497205902,57.369964678563399,5,1]
["Aduna",465,91.35,78.924731182795711,82.705099778270508,0.83,1.04,94.17,2.71,1.25,28.5384312330021,36.613597497205902,57.369964678563399,5,1]
["Agurain-Salvatierra",5207,33.17,4.9356635298636453,3.4648507911075508,61.7,2.12,5.17,18.07,12.94,28.5384312330021,36.613597497205902,57.369964678563399,5,1]
["Aia",2057,87.83,75.206611570247944,76.408450704225345,0.45,1.24,89.11,3.37,5.84,28.5384312330021,36.613597497205902,57.369964678563399,5,1]
["Aizarnazabal",749,83.54,73.56475300400534,74.616457461645751,0.39,3,83.94,4.7,7.96,28.5384312330021,36.613597497205902,57.369964678563399,5,1]
["Ajangiz",465,91.63,78.064516129032256,66.519823788546248,0.44,91.92,1.0900000000000001,3.28,3.28,28.5384312330021,36.613597497205902,57.369964678563399,5,1]
["Albiztur",301,91.7,81.72757475083057,85.467128027681667,0,0,95.03,2.98,1.99,28.5384312330021,36.613597497205902,57.369964678563399,5,1]
["Alegia",1780,78.510000000000005,60.955056179775283,61.059907834101381,0.11,0.28999999999999998,80.33,8.67,10.6,28.5384312330021,36.613597497205902,57.369964678563399,5,1]
["Alegría-Dulantzi",3029,36.86,4.8200726312314295,3.614047050801227,57.48,7.11,5.81,18.66,10.94,28.5384312330021,36.613597497205902,57.369964678563399,5,1]
["Alkiza",354,88.79,73.728813559322035,79.056047197640126,0.56000000000000005,0.56000000000000005,92.66,3.39,2.82,28.5384312330021,36.613597497205902,57.369964678563399,5,1]
["Alonsotegi",2888,29.84,3.7049861495844874,2.7708703374777972,0.53,75.819999999999993,0.46,17.190000000000001,6.01,28.5384312330021,36.613597497205902,57.369964678563399,5,1]
["Altzaga",175,88.69,73.714285714285708,79.166666666666657,0,0,94.57,2.17,3.26,28.5384312330021,36.613597497205902,57.369964678563399,5,1]
["Altzo",364,88.17,78.021978021978029,79.718309859154928,0,1.4,91.34,3.91,3.35,28.5384312330021,36.613597497205902,57.369964678563399,5,1]
["Amezketa",913,90.68,83.35158817086527,83.389450056116715,0.33,0.65,89.92,2.71,6.39,28.5384312330021,36.613597497205902,57.369964678563399,5,1]
["Amorebieta-Etxano",18633,56.16,32.86105297053615,23.225735131549857,0.44,73.25,1.58,15.03,9.6999999999999993,28.5384312330021,36.613597497205902,57.369964678563399,5,1]
["Amoroto",412,90.86,83.009708737864074,80.246913580246911,0.72,89.5,2.15,0.95,6.68,28.5384312330021,36.613597497205902,57.369964678563399,5,1]
["Amurrio",10336,33.69,4.0537925696594428,2.5879296562749801,46.8,28.07,0.78,16.5,7.85,28.5384312330021,36.613597497205902,57.369964678563399,5,1]
["Añana",169,20.239999999999998,1,1,70.56,6.11,3.33,10.56,9.44,28.5384312330021,36.613597497205902,57.369964678563399,5,1]
["Andoain",14859,56.33,31.576822128003229,25.031107424305265,0.32,0.84,70.86,21.27,6.71,28.5384312330021,36.613597497205902,57.369964678563399,5,1]
["Anoeta",2037,72.77,53.411880216003929,45.035823950870011,0.15,0.86,80.52,10.29,8.17,28.5384312330021,36.613597497205902,57.369964678563399,5,1]
["Antzuola",2196,77.83,59.153005464480877,54.90840770314702,1.44,2.0299999999999998,79.81,12.26,4.46,28.5384312330021,36.613597497205902,57.369964678563399,5,1]
["Arakaldo",171,55.95,28.07017543859649,18.452380952380953,18.29,63.41,0,9.15,9.15,28.5384312330021,36.613597497205902,57.369964678563399,5,1]
["Arama",213,83.33,68.075117370892031,63.809523809523803,0,1.44,87.08,2.87,8.61,28.5384312330021,36.613597497205902,57.369964678563399,5,1]
["Aramaio",1534,81.59,68.70925684485006,58.366800535475235,63.31,4.47,23.6,5.13,3.48,28.5384312330021,36.613597497205902,57.369964678563399,5,1]
["Arantzazu",404,77.040000000000006,55.198019801980202,47.193877551020407,0.27,85.6,0.82,7.34,5.98,28.5384312330021,36.613597497205902,57.369964678563399,5,1]
["Areatza",1178,64.900000000000006,42.614601018675721,30.495221546481321,0.9,78.72,0.82,7.69,11.87,28.5384312330021,36.613597497205902,57.369964678563399,5,1]
["Aretxabaleta",7003,66.64,45.194916464372412,36.662267194603317,7.22,2.1800000000000002,68.45,16.03,6.12,28.5384312330021,36.613597497205902,57.369964678563399,5,1]
["Armiñon",225,24.43,2.666666666666667,0.90497737556561098,57.48,3.74,5.61,27.57,5.61,28.5384312330021,36.613597497205902,57.369964678563399,5,1]
["Arraia-Maeztu",730,28.05,3.1506849315068495,2.2662889518413598,75.66,2.8,2.8,3.89,5,28.5384312330021,36.613597497205902,57.369964678563399,5,1]
["Arrankudiaga",996,57.93,32.228915662650607,21.494370522006143,8.06,79.959999999999994,0.49,12.59,6.15,28.5384312330021,36.613597497205902,57.369964678563399,5,1]
["Arrasate-Mondragon",21929,57.1,34.347211455150713,26.586652967823287,8.91,3.17,58,7.56,3.93,28.5384312330021,36.613597497205902,57.369964678563399,5,1]
["Arratzu",402,89.97,78.358208955223887,74.550128534704371,0.24,90.84,0.96,20.21,9.7100000000000009,28.5384312330021,36.613597497205902,57.369964678563399,5,1]
["Arratzua-Ubarrundia",1019,34.4,5.7899901864573113,2.9910269192422732,67.31,5.61,7.06,2.65,5.3,28.5384312330021,36.613597497205902,57.369964678563399,5,1]
["Arrieta",553,75.180000000000007,51.175406871609411,41.970802919708028,0.18,89.25,0.73,14.89,5.13,28.5384312330021,36.613597497205902,57.369964678563399,5,1]
["Arrigorriaga",11989,38.47,7.3567436817082328,4.6982721933781599,1.19,73.78,0.84,6.01,3.83,28.5384312330021,36.613597497205902,57.369964678563399,5,1]
["Artea",735,78.58,61.496598639455783,52.990264255910994,0.42,90,0.69,18.43,5.77,28.5384312330021,36.613597497205902,57.369964678563399,5,1]
["Artzentales",731,25.98,4.9247606019151844,3.4916201117318435,0.56000000000000005,84.18,1.55,9.18,4.5199999999999996,28.5384312330021,36.613597497205902,57.369964678563399,5,1]
["Artziniega",1845,33.67,2.9268292682926833,3.350083752093802,35.18,43.87,0.31,14.28,6.36,28.5384312330021,36.613597497205902,57.369964678563399,5,1]
["Asparrena",1658,37.76,8.0217129071170081,6.1376317420954747,67.3,2.3199999999999998,7.7,14.61,8.07,28.5384312330021,36.613597497205902,57.369964678563399,5,1]
["Asteasu",1479,83.41,67.275185936443535,68.203716448726766,0.13,0.72,87,6.47,5.68,28.5384312330021,36.613597497205902,57.369964678563399,5,1]
["Astigarraga",6053,64.739999999999995,35.536097802742439,29.469683883226811,0.46,1.32,80.56,10.66,7.01,28.5384312330021,36.613597497205902,57.369964678563399,5,1]
["Ataun",1679,87.18,77.069684335914232,76.757090012330451,0.17,0.7,89.26,4.41,5.46,28.5384312330021,36.613597497205902,57.369964678563399,5,1]
["Atxondo",1379,66.27,48.005801305293694,36.948391922213915,0.56000000000000005,72.680000000000007,4.26,16.21,6.29,28.5384312330021,36.613597497205902,57.369964678563399,5,1]
{"$rows_left_out":1793}
{"sheet":"GALDETEGI LABURRA","index":1,"n_rows":14,"n_cols":3,"rows_kept":14,"cut":false,"hidden":false,"merged":[[7,0,7,2],[1,0,1,2],[0,0,0,2]]}
["Kultura eta Hizkuntza Politika Saila"]
["1. PLANAREN/EGITASMOAREN GAINEKO DATUAK"]
[null,"Eremua","Eremua aukeratu"]
[null,"Udalerria ez den \neremuaren izena"]
[null,"Planaren/Egitasmoaren\nizena"]
[null,"Eragin Linguistikoaren \nEbaluazioaz arduratuko \nden batzordearen izena"]
[]
["2. GALDETEGI LABURRA"]
[]
[]
["GALDERA","BAI/EZ","AZALPENA"]
["1. Planak/egitasmoak izango du eraginik tokiko biztanleria kopuruan?\n (etxebizitzak eraikiko direlako, lanpostuak sortuko delako...)","EZ"]
["2. Planak/egitasmoak izango al du eragin nabarmenik tokiko bisitari kopuruan?\n (aisialdi guneak eraikiko delako, zerbitzuak sortuko direlako, lanpostuak ugarituko direlako...)","EZ"]
["3.Planak/egitasmoak egoera soziolingistikoan beste era batera eragin nabarmenik izango du?","EZ"]

{"sheet":"Eremua aukeratu","index":2,"n_rows":38,"n_cols":6,"rows_kept":38,"cut":false,"hidden":false,"merged":[[0,0,0,5],[6,0,6,5],[34,0,34,1],[12,0,12,1],[2,2,2,3],[3,2,3,3],[4,2,4,3],[29,0,29,1],[21,0,21,1]]}
["Kultura eta Hizkuntza Politika Saila"]
[]
[null,"Eremua",{"$f":"IF(EXACT('GALDETEGI LABURRA'!C3,\"Beste\"),OTROMUNICIPIO,'GALDETEGI LABURRA'!C3)","v":"Eremua aukeratu"}]
[null,"Planaren/Egitasmoaren\nizena",{"$f":"IF('GALDETEGI LABURRA'!C5=\"\",\"\",'GALDETEGI LABURRA'!C5)","v":""}]
[null,"Eragin Linguistikoaren \nEbaluazioaz arduratuko \nden batzordearen izena",{"$f":"IF('GALDETEGI LABURRA'!C6=\"\",\"\",'GALDETEGI LABURRA'!C6)","v":""}]
[]
["Euskararen Proiekzio Indizea"]
["Biztanleen kopurua gaur egun",{"$f":"ROUND(VLOOKUP(UDALERRIA,Datos!A34:O286,2,FALSE),0)","v":0}]
["Euskaldunak gaur egun kopurutan",{"$f":"ROUND(B8*B10/100,0)","v":0}]
["Euskaldunak gaur egun %",{"$f":"VLOOKUP(UDALERRIA,Datos!A34:O286,3,FALSE)","v":0}]
["Biztanle/bisitari berrien kopurua"]
[]
["BIZTANLE/BISITARI BERRIEN JATORRIA PORTZENTAJETAN",null,"KOPURUTAN"]
["Araba",{"$f":"VLOOKUP(UDALERRIA,Datos!A34:O286,6,FALSE)","v":0},{"$f":"B14*B11/100","v":0}]
["Bizkaia",{"$f":"VLOOKUP(UDALERRIA,Datos!A34:O286,7,FALSE)","v":0},{"$f":"B11*B15/100","v":0}]
["Gipuzkoa",{"$f":"VLOOKUP(UDALERRIA,Datos!A34:O286,8,FALSE)","v":0},{"$f":"B11*B16/100","v":0}]
["Estatuko gainontzeko lurraldeak",{"$f":"VLOOKUP(UDALERRIA,Datos!A34:O286,9,FALSE)","v":0},{"$f":"B11*B17/100","v":0}]
["Atzerrikoak",{"$f":"VLOOKUP(UDALERRIA,Datos!A34:O286,10,FALSE)","v":0},{"$f":"B11*B18/100","v":0}]
["DENETARA",{"$f":"SUM(B14:B18)","v":0}]
[]
[]
["EUSKARAREN EZAGUTZA JATORRIAREN ARABERA"]
[null,{"$f":"A14","v":"Araba"},{"$f":"A15","v":"Bizkaia"},{"$f":"A16","v":"Gipuzkoa"},{"$f":"A17","v":"Estatuko gainontzeko lurraldeak"},{"$f":"A18","v":"Atzerrikoak"}]
["Euskaldunak %",{"$f":"VLOOKUP(UDALERRIA,Datos!A34:O286,11,FALSE)","v":0},{"$f":"VLOOKUP(UDALERRIA,Datos!A34:O286,12,FALSE)","v":0},{"$f":"VLOOKUP(UDALERRIA,Datos!A34:O286,13,FALSE)","v":0},{"$f":"VLOOKUP(UDALERRIA,Datos!A34:O286,14,FALSE)","v":0},{"$f":"VLOOKUP(UDALERRIA,Datos!A34:O286,15,FALSE)","v":0}]
["Besteak %",{"$f":"100-B24","v":100},{"$f":"100-C24","v":100},{"$f":"100-D24","v":100},{"$f":"100-E24","v":100},{"$f":"100-F24","v":100}]
["Euskaldunak",{"$f":"C14*B24/100","v":0},{"$f":"C15*C24/100","v":0},{"$f":"C16*D24/100","v":0},{"$f":"C17*E24/100","v":0},{"$f":"C18*F24/100","v":0}]
["Besteak",{"$f":"C14*B25/100","v":0},{"$f":"C15*C25/100","v":0},{"$f":"C16*D25/100","v":0},{"$f":"C17*E25/100","v":0},{"$f":"C18*F25/100","v":0}]
[]
[]
["BIZTANLE/BISITARI BERRIEN KOPURUA EZAGUTZAREN ARABERA"]
[]
["Biztanle/Bisitari berrien kopurua","Etorriko diren erdaldunak","Etorriko diren euskaldunak"]
[{"$f":"B11","v":0},{"$f":"D27+B27+C27+E27+F27","v":0},{"$f":"D26+B26+C26+E26+F26","v":0}]
[]
["EUSKARA EZAGUTZA TASAK (ORAINGOAK ETA GEROKOAK) ETA KONPARAKETA"]
[]
["Biztanle/bisitari berriak + ohikoak","Biztanle/bisitari euskaldun ohikoak + berriak ","Biztanle/bisitari euskaldun ohikoak +berriak %","Euskaldunen % gaur egun","EPI%","EPI"]
[{"$f":"B8+B11","v":0},{"$f":"B9+C33","v":0},{"$f":"B38/A38*100","v":{"$error":"#DIV/0!"}},{"$f":"B10","v":0},{"$f":"C38-D38","v":{"$error":"#DIV/0!"}},{"$f":"E38*1","v":{"$error":"#DIV/0!"}}]

{"sheet":"Eremuaren Datuak","index":3,"n_rows":25,"n_cols":3,"rows_kept":25,"cut":false,"hidden":false,"merged":[[0,0,0,5],[6,0,6,1],[24,1,24,5],[2,0,4,0]]}
["Kultura eta Hizkuntza Politika Saila"]
[]
[null,"Eremua",{"$f":"'Eremua aukeratu'!C3","v":"Eremua aukeratu"}]
[null,"Planaren/Egitasmoaren\nizena",{"$f":"'Eremua aukeratu'!C4","v":""}]
[null,"Eragin Linguistikoaren \nEbaluazioaz arduratuko \nden batzordearen izena",{"$f":"'Eremua aukeratu'!C5","v":""}]
[]
[null,null,"Oharrak"]
["Guztira",{"$f":"ROUND(VLOOKUP(UDALERRIA,Datos!A34:O286,2,FALSE),0)","v":0}]
["Euskaldunak - Guztira%",{"$f":"VLOOKUP(UDALERRIA,Datos!A34:O286,3,FALSE)","v":0}]
["Ama-hizkuntza euskara - Guztira%",{"$f":"VLOOKUP(UDALERRIA,Datos!A34:O286,4,FALSE)","v":0}]
["Etxean erabiltzen den hizkuntza - Guztira%",{"$f":"VLOOKUP(UDALERRIA,Datos!A34:O286,5,FALSE)","v":0}]
["Euskara Zerbitzua","EZ"]
["ESEP","EZ"]
["Faktorea biztanle kopurua",{"$f":"LOOKUP(B8,HI!$D$4:$F$11)","v":6}]
["Faktorea Euskaldunak",{"$f":"LOOKUP(B9,HI!$D$12:$F$20)","v":-2}]
["Faktorea Lehen hizkuntza",{"$f":"LOOKUP(B10,HI!$D$21:$F$30)","v":-2}]
["Faktorea Etxeko hizkuntza",{"$f":"LOOKUP(B11,HI!$D$31:$F$40)","v":-2}]
["Faktorea Euskararen inguruko egituraketa",{"$f":"LOOKUP(COUNTIF(B12:B13,\"EZ\"),HI!$D$41:$E$43)","v":4}]
["Hauskortasun indizea",{"$f":"(((B17*2)+B15+B16)/3)+(B14+B18)","v":7.3333333333333339}]
["Hiren eraginaren balioa",{"$f":"LOOKUP(B19,HI!$K$3:$M$6)","v":1}]
["Euskararen proiekzio indizea",{"$f":"'Eremua aukeratu'!$F$38","v":{"$error":"#DIV/0!"}}]
["Bilakaera indizea",{"$f":"B20+B21","v":{"$error":"#DIV/0!"}}]
[]
[]
["TXOSTENA EGIN BEHARRA - IZAERA",{"$f":"IF(B22<0,HI!$B$62,HI!$B$61)","v":{"$error":"#DIV/0!"}}]

{"sheet":"Eremuaren izena idatzi","index":4,"n_rows":38,"n_cols":6,"rows_kept":38,"cut":false,"hidden":true,"merged":[[0,0,0,5],[6,0,6,5],[12,0,12,1],[34,0,34,1]]}
["Kultura eta Hizkuntza Politika Saila"]
[]
[null,"Eremua",{"$f":"OTROMUNICIPIO","v":0}]
[null,"Proiektuaren izena",{"$f":"IF('GALDETEGI LABURRA'!C5=\"\",\"\",'GALDETEGI LABURRA'!C5)","v":""}]
[null,"Teknikariaren izena",{"$f":"IF('GALDETEGI LABURRA'!C6=\"\",\"\",'GALDETEGI LABURRA'!C6)","v":""}]
[]
["Euskararen Proiekzio Indizea"]
["Biztanleen kopurua gaur egun"]
["Euskaldunak gaur egun kopurutan",{"$f":"B8*B10/100","v":0}]
["Euskaldunak gaur egun %"]
["Biztanle/bisitari berrien kopurua"]
[]
["BIZTANLE/BISITARI BERRIEN JATORRIA PORTZENTAJETAN",null,"KOPURUTAN"]
[null,null,{"$f":"B14*B11/100","v":0}]
[null,null,{"$f":"B11*B15/100","v":0}]
[null,null,{"$f":"B11*B16/100","v":0}]
[null,null,{"$f":"B11*B17/100","v":0}]
[null,null,{"$f":"B11*B18/100","v":0}]
["DENETARA",{"$f":"SUM(B14:B18)","v":0}]
[]
[]
["EUSKARAREN EZAGUTZA JATORRIAREN ARABERA"]
[null,{"$f":"IF(A14=0,\"\",A14)","v":""},{"$f":"IF(A15=0,\"\",A15)","v":""},{"$f":"IF(A16=0,\"\",A16)","v":""},{"$f":"IF(A17=0,\"\",A17)","v":""},{"$f":"IF(A18=0,\"\",A18)","v":""}]
["Euskaldunak %"]
["Besteak %",{"$f":"100-B24","v":100},{"$f":"100-C24","v":100},{"$f":"100-D24","v":100},{"$f":"100-E24","v":100},{"$f":"100-F24","v":100}]
["Euskaldunak",{"$f":"C14*B24/100","v":0},{"$f":"C15*C24/100","v":0},{"$f":"C16*D24/100","v":0},{"$f":"C17*E24/100","v":0},{"$f":"C18*F24/100","v":0}]
["Besteak",{"$f":"C14*B25/100","v":0},{"$f":"C15*C25/100","v":0},{"$f":"C16*D25/100","v":0},{"$f":"C17*E25/100","v":0},{"$f":"C18*F25/100","v":0}]
[]
[]
["BIZTANLE/BISITARI BERRIEN KOPURUA EZAGUTZAREN ARABERA"]
[]
["Biztanle/Bisitari berrien kopurua","Etorriko diren erdaldunak","Etorriko diren euskaldunak"]
[{"$f":"B11","v":0},{"$f":"D27+B27+C27+E27+F27","v":0},{"$f":"D26+B26+C26+E26+F26","v":0}]
[]
["EUSKARA EZAGUTZA TASAK (ORAINGOAK ETA GEROKOAK) ETA KONPARAKETA"]
[]
["Biztanle/bisitari berriak + ohikoak","Biztanle/bisitari euskaldun ohikoak + berriak ","Biztanle/bisitari euskaldun ohikoak +berriak %","Euskaldunen % gaur egun","EPI%","EPI"]
[{"$f":"B8+B11","v":0},{"$f":"B9+C33","v":0},{"$f":"B38/A38*100","v":{"$error":"#DIV/0!"}},{"$f":"B10","v":0},{"$f":"C38-D38","v":{"$error":"#DIV/0!"}},{"$f":"E38*1","v":{"$error":"#DIV/0!"}}]

{"sheet":"Eremuaren Datuak B","index":5,"n_rows":25,"n_cols":3,"rows_kept":25,"cut":false,"hidden":true,"merged":[[24,1,24,5],[0,0,0,5],[2,0,4,0]]}
["Kultura eta Hizkuntza Politika Saila"]
[]
[null,"Eremua",{"$f":"'Eremuaren izena idatzi'!C3","v":0}]
[null,"Proiektuaren izena",{"$f":"'Eremuaren izena idatzi'!C4","v":""}]
[null,"Teknikariaren izena",{"$f":"'Eremuaren izena idatzi'!C5","v":""}]
[]
[null,null,"Oharrak"]
["Guztira",{"$f":"'Eremuaren izena idatzi'!B8","v":0}]
["Euskaldunak - Guztira%",{"$f":"'Eremuaren izena idatzi'!B10","v":0}]
["Ama-hizkuntza euskara - Guztira%",0]
["Etxean erabiltzen den hizkuntza - Guztira%",0]
["Euskara Zerbitzua","BAI"]
["ESEP","BAI"]
["Faktorea biztanle kopurua",{"$f":"LOOKUP(B8,HI!$D$4:$F$11)","v":6}]
["Faktorea Euskaldunak",{"$f":"LOOKUP(B9,HI!$D$12:$F$20)","v":-2}]
["Faktorea Lehen hizkuntza",{"$f":"LOOKUP(B10,HI!$D$21:$F$30)","v":-2}]
["Faktorea Etxeko hizkuntza",{"$f":"LOOKUP(B11,HI!$D$31:$F$40)","v":-2}]
["Faktorea Euskararen inguruko egituraketa",{"$f":"LOOKUP(COUNTIF(B12:B13,\"EZ\"),HI!$D$41:$E$43)","v":0}]
["Hauskortasun indizea",{"$f":"(((B17*2)+B15+B16)/3)+(B14+B18)","v":3.3333333333333335}]
["Hiren eraginaren balioa",{"$f":"LOOKUP(B19,HI!$K$3:$M$6)","v":2}]
["Euskararen proiekzio indizea",{"$f":"'Eremuaren izena idatzi'!F38","v":{"$error":"#DIV/0!"}}]
["Bilakaera indizea",{"$f":"B20+B21","v":{"$error":"#DIV/0!"}}]
[]
[]
["TXOSTENA EGIN BEHARRA - IZAERA",{"$f":"IF(B22<0,HI!B62,HI!B61)","v":{"$error":"#DIV/0!"}}]

{"sheet":"HI","index":6,"n_rows":261,"n_cols":13,"rows_kept":261,"cut":false,"hidden":true,"merged":[[0,7,0,9],[3,0,10,0],[11,0,19,0],[20,0,29,0],[30,0,39,0],[47,1,47,2],[54,1,54,2],[63,1,63,2],[40,0,42,0],[0,0,1,2]]}
["ADIERAZLEAK",null,null,null,null,null,null,"EMAITZA"]
[null,null,null,null,null,null,null,"PUNTUAZIOA","HAUSKORTASUN MAILA","Hiren balioa","DESDE","HASTA","VALOR"]
[null,"ESKALA","BALIOA","ESCALA CRECIENTE",null,"VALOR",null,"0-5,99 ","Hauskortasun txikia",2,-1000,5.99,2]
["Udalerriko biztanle kopurua","500 biztanletik beherea",6,0,500,6,null,"6-9,99","Hauskortasun Ertaina",1,6,9.99,1]
[null,"501 eta 1.000 biztanle bitartean",5,501,1000,5,null,"10-13,99","Hauskortasun Handia",0,10,13.99,0]
[null,"1.001 eta 3.000 biztanle bitartean",4,1001,3000,4,null,"14-18","Hauskortasun Oso Handia",-1,14,18,-1]
[null,"3.001 eta 5.000 biztanle bitartean",3,3001,5000,3]
[null,"5.001 eta 20.000 biztanle bitartean",2,5001,20000,2]
[null,"20,000-40,000",1,20001,40000,1]
[null,"40,000- 100,00",-1,40001,100000,-1]
[null,"100,00-400,000",-2,100001,400000,-2]
["Euskaldunen ehunekoa","%90etik gora",6,0,20,-2]
[null,"%90 eta %80 bitartean",5,21,30,-1]
[null,"%80 eta %70 bitartean",4,31,40,0]
[null,"%70 eta %60 bitartean",3,41,50,1]
[null,"%60 eta %50 bitartean",2,51,60,2]
[null,"%50eta %40 bitartean",1,61,70,3]
[null,"%40 eta %30 bitartean",0,71,80,4]
[null,"%30 eta %20 bitartean",-1,81,90,5]
[null,"%20 eta %0 bitartean",-2,91,100,6]
["Lehen hizkuntzaren ehunekoa","%90etik gora",6,0,10,-2]
[null,"%90 eta %80 bitartean",6,11,20,-1]
[null,"%80 eta %70 bitartean",5,21,30,0]
[null,"%70 eta %60 bitratean",4,31,40,1]
[null,"%60 eta %50 bitartean",3,41,50,2]
[null,"%50 eta %40 bitartean",2," ",60,3]
[null,"%40 eta %30 bitartean",1,61,70,4]
[null,"%30 eta %20 bitartean",0,71,80,5]
[null,"%20 eta %10 bitartean",-1,81,90,6]
[null,"%10 baino txikiagoa",-2,91,100,6]
["Etxeko hizkuntzaren ehunekoa","%90etik gora",6,0,10,-2]
[null,"%90 eta %80 bitartean",6,11,20,-1]
[null,"%80 eta %70 bitartean",5,21,30,0]
[null,"%70 eta %60 bitartean",4,31,40,1]
[null,"%60 eta %50 bitartean",3,41,50,2]
[null,"%50 eta %40 bitartean",2,51,60,3]
[null,"%40 eta %30 bitartean",1,61,70,4]
[null,"%30 eta %20 bitartean",0,71,80,5]
[null,"%20 eta %10 bitartean",-1,81,90,6]
[null,"%10 baino txikiagoa",-2,91,100,6]
["Euskararen inguruko egituraketa","Euskara Zerbitzua eta ESEP plana daukate  E",0,0,0]
[null,"Euskara zerbitzua daukate edo ESEP daukate",2,1,2]
[null,"Bat ere ez",4,2,4]
[null,null,null,"Num. de Blancos","Valor"]
[]
[]
[]
["Nota:","La formula que se utiliza para calcular el valor, necesita que los rangos esten ordenados de menor a mayor, por esta razón se han creado las columnas D,E y F. Si se cambiaran los valores (Columna C) o los rangos (Columna B) se deberian modificar los valores de las columnas D y E (corresponden a los rangos) y la columna F (corresponde al valor).\nEn el caso de \"Euskararen inguruko egituraketa\"  la columna D corresponde al número de \"EZ\" y la E al valor que se le da."]
[]
[]
[null,"Valores desplegbles BAI/EZ"]
[null,"BAI"]
[null,"EZ"]
[]
["Nota:","Se han introducido estos valores ya que son necesarios para que las listas desplegables del EXCEL indiquen que los valores posibles son \"BAI\",\"EZ\"."]
[]
[]
[]
[]
[null,"IZAERA"]
[null,"HIZKUNTZA INPAKTUKO AZTERLANA EZ"]
[null,"HIZKUNTZA INPAKTUKO AZTERLANA BAI"]
[]
["Nota:","Estos valores son los que indican el texto y el formato que van a dar al valor de la columna \"TXOSTENA EGIN BEHARRA - IZAERA\".\nEl formato se indica en la misma hoja donde aparecen los datos (tanto de Municipio como el del Beste)"]
[]
[]
[]
[]
[null,{"$f":"IF('GALDETEGI LABURRA'!C5=\"\",\"\",'GALDETEGI LABURRA'!C5)","v":""}]
[]
[]
[]
[]
[]
[]
[]
[]
[]
[]
[]
{"$rows_left_out":182}
{"sheet":"BHI","index":7,"n_rows":2,"n_cols":9,"rows_kept":2,"cut":false,"hidden":true,"merged":[[0,0,0,3],[0,4,0,7],[0,8,0,11],[1,0,1,3],[1,4,1,7],[1,8,7,11]]}
["Biztanleriaren hazkunde indizea ",null,null,null,"Bizitarien hazkunde indizea ",null,null,null,"Euskararen Proiekzio Indizea"]
["Etxebizitza kopurua X 3",null,null,null,"Estimazio bat",null,null,null,"Herri horretako migrazio joerak kontsultatu EUSTATen eta horren arabera, kalkulu hauek egin behar dira:\n1. biztanleak edo bisitariak zein lekutatik etorriko diren  eta zein portzentajetan kontsultatu eta leku horietako euskararen ezagutza jarri.\n2, etorriko diren biztanle edo bisitari berrien artean zenbat izango diren euskaldunak kalkulatu eta batu orain herrian dauden euskaldunei.\n3. Gauza bera egin besteeekin eta gero kalkulatu euskaldune balizko portzentajea balizko populazio osoarekiko.\noraingo euskaldunen portzentajea eta bailzkoa konparatu eta saldoa jarri, negatiboan edo positiboan (normalean negatiboa izango da)=EPI"]