{"text_format":"1","workbook":"xlsx","n_sheets":6,"sheets":["Portada","Intro","entrada datos Edificación","entrada datos Urbanizacion","resultados","CALCULO_EDIF"],"not_rendered":{"charts":8,"images":2,"macros":1,"external_links":1,"defined_names":1,"comments":0,"pivot_tables":0},"unopened":[],"bounds":{"document_bytes":16777216,"sheet_cells":100000,"rows_first":2000,"rows_last":500,"rows_between":2000,"halvings":0,"cell_chars":16384,"cell_head_chars":4096},"cells_cut":0,"cells_raw":0,"read":"whole","date_system":"1900"}

{"sheet":"Portada","index":0,"n_rows":0,"n_cols":0,"rows_kept":0,"cut":false,"hidden":false,"merged":[]}

{"sheet":"Intro","index":1,"n_rows":28,"n_cols":10,"rows_kept":28,"cut":false,"hidden":false,"merged":[[25,2,25,3],[26,2,26,3],[27,2,27,3],[22,2,22,3],[10,1,10,3],[20,2,20,3],[24,1,24,3],[16,2,16,3],[18,2,18,3],[21,2,21,3],[23,2,23,3],[14,2,14,3],[17,2,17,3],[19,1,19,3],[11,2,11,3],[12,2,12,3],[13,2,13,3],[3,1,3,3],[4,2,4,3],[5,2,5,3],[6,2,6,3],[7,2,7,3],[5,1,9,1],[8,2,8,3],[9,2,9,3]]}
[]
[]
[]
[null,"Agentes"]
[null,"Promotor"]
[null,"Proyectistas, Constructor y otros Agentes"]
[]
[]
[]
[]
[null,"Emplazamiento de la obra"]
[null,"Denominación de la obra"]
[null,"Dirección"]
[null,"Municipio"]
[null,"Territorio Histórico","Bizkaia"]
{"$rows_left_out":14}
{"sheet":"entrada datos Edificación","index":2,"n_rows":172,"n_cols":21,"rows_kept":172,"cut":false,"hidden":false,"merged":[[94,14,94,15],[111,14,111,15],[1,14,1,15],[11,14,11,15],[26,14,26,15],[58,14,58,15],[78,14,78,15],[95,20,100,20],[102,20,104,20],[106,20,108,20],[133,20,137,20],[112,20,122,20],[124,20,131,20],[2,20,4,20],[6,20,8,20],[12,20,13,20],[15,20,19,20],[27,20,35,20],[79,20,88,20],[90,20,91,20],[37,20,45,20],[47,20,50,20],[52,20,55,20],[59,20,69,20],[71,20,75,20],[165,20,170,20],[140,14,140,15],[141,20,145,20],[147,20,151,20],[158,20,163,20],[153,20,156,20]]}
["Valor:"]
[null,"fila empieza","Fila termina","Lista asociada","Para poner en la lista",null,"ACONDICIONAMIENTO Y CIMENTACION",null,"m3","o","Kg","d","kg","Material seleccionado","% reciclado",null,null,"Material\nReciclado\n[Kg]","Material\nno Reciclado\n[Kg]",null,"Material Reciclado\n[%]"]
[{"$f":"CONCATENATE(\"CALCULO_EDIF!\",\"C\",C3,\":\",\"D\",D3)","v":"CALCULO_EDIF!C24:D1"},{"$f":"IF(D3=1,1,(D3*25-1))","v":1},{"$f":"IF(D3=1,24,B3+24)","v":24},1,{"$f":"CONCATENATE(\"CALCULO_EDIF!\",\"C\",B3,\":\",\"C\",C3)","v":"CALCULO_EDIF!C1:C24"},null,"CIMENTACIONES","hormigón zapatas y pilotes",50,null,null,2500,{"$f":"IF(AND(ISBLANK(I3)*ISBLANK(K3)),\"-\",IF(AND(NOT(ISBLANK(I3))*NOT(ISBLANK(K3))),\"Error\",IF(ISBLANK(I3),K3,I3*L3)))","v":125000},"Cemento CEM I-Cementos Lemona, S.A. ",{"$f":"IF(N3=\"Otro\",$A$1,VLOOKUP(N3, INDIRECT(A3),2,FALSE))","v":0.03},0.4,null,{"$f":"IF(O3=\"Valor:\",M3*P3,M3*O3)","v":3750},{"$f":"M3-R3","v":121250},null,{"$f":"SUM(R3:R5)/SUM(M3:M5)","v":0.23328699469544542}]
[{"$f":"CONCATENATE(\"CALCULO_EDIF!\",\"C\",C4,\":\",\"D\",D4)","v":"CALCULO_EDIF!C49:D2"},{"$f":"IF(D4=1,1,(D4-1)*25)","v":25},{"$f":"IF(D4=1,24,B4+24)","v":49},2,{"$f":"CONCATENATE(\"CALCULO_EDIF!\",\"C\",B4,\":\",\"C\",C4)","v":"CALCULO_EDIF!C25:C49"},null,null,"hormigón losas y soleras",null,null,10,2500,{"$f":"IF(AND(ISBLANK(I4)*ISBLANK(K4)),\"-\",IF(AND(NOT(ISBLANK(I4))*NOT(ISBLANK(K4))),\"Error\",IF(ISBLANK(I4),K4,I4*L4)))","v":10},"Cemento CEM I-Cementos Lemona, S.A. ",{"$f":"IF(N4=\"Otro\",$A$1,VLOOKUP(N4, INDIRECT(A4),2,FALSE))","v":0.03},0.4,null,{"$f":"IF(O4=\"Valor:\",M4*P4,M4*O4)","v":0.3},{"$f":"M4-R4","v":9.6999999999999993}]
["CALCULO_EDIF!C74:D3",{"$f":"IF(D5=1,1,(D5-1)*25)","v":50},74,3,"CALCULO_EDIF!C50:C74",null,null,"acero  armaduras",5,null,null,7800,{"$f":"IF(AND(ISBLANK(I5)*ISBLANK(K5)),\"-\",IF(AND(NOT(ISBLANK(I5))*NOT(ISBLANK(K5))),\"Error\",IF(ISBLANK(I5),K5,I5*L5)))","v":39000},"Barras Corrugadas- Arcelor Mittal",{"$f":"IF(N5=\"Otro\",$A$1,VLOOKUP(N5, INDIRECT(A5),2,FALSE))","v":0.88490000000000002},0.4,null,{"$f":"IF(O5=\"Valor:\",M5*P5,M5*O5)","v":34511.1},{"$f":"M5-R5","v":4488.9000000000015}]
[]
["CALCULO_EDIF!C99:D4",75,99,4,{"$f":"CONCATENATE(\"CALCULO_EDIF!\",\"C\",B7,\":\",\"C\",C7)","v":"CALCULO_EDIF!C75:C99"},null,"ACONDICIONAMIENTO DEL TERRENO","material de explanadas, terraplenes o afines",null,null,20,2050,{"$f":"IF(AND(ISBLANK(I7)*ISBLANK(K7)),\"-\",IF(AND(NOT(ISBLANK(I7))*NOT(ISBLANK(K7))),\"Error\",IF(ISBLANK(I7),K7,I7*L7)))","v":20},"material n02",{"$f":"IF(N7=\"Otro\",$A$1,VLOOKUP(N7, INDIRECT(A7),2,FALSE))","v":0.1},0.4,null,{"$f":"IF(O7=\"Valor:\",M7*P7,M7*O7)","v":2},{"$f":"M7-R7","v":18},null,{"$f":"SUM(R7:R9)/SUM(M7:M9)","v":0.2851503759398496}]
["CALCULO_EDIF!C124:D5",{"$f":"IF(D8=1,1,(D8-1)*25)","v":100},124,5,{"$f":"CONCATENATE(\"CALCULO_EDIF!\",\"C\",B8,\":\",\"C\",C8)","v":"CALCULO_EDIF!C100:C124"},null,null,"rellenos",3,null,null,1600,{"$f":"IF(AND(ISBLANK(I8)*ISBLANK(K8)),\"-\",IF(AND(NOT(ISBLANK(I8))*NOT(ISBLANK(K8))),\"Error\",IF(ISBLANK(I8),K8,I8*L8)))","v":4800},"Otro",{"$f":"IF(N8=\"Otro\",$A$1,VLOOKUP(N8, INDIRECT(A8),2,FALSE))","v":"Valor:"},0.3,null,{"$f":"IF(O8=\"Valor:\",M8*P8,M8*O8)","v":1440},{"$f":"M8-R8","v":3360}]
["CALCULO_EDIF!C149:D6",125,149,6,"CALCULO_EDIF!C125:C149",null,null,"zahorras",null,null,500,2200,{"$f":"IF(AND(ISBLANK(I9)*ISBLANK(K9)),\"-\",IF(AND(NOT(ISBLANK(I9))*NOT(ISBLANK(K9))),\"Error\",IF(ISBLANK(I9),K9,I9*L9)))","v":500},"material n03",{"$f":"IF(N9=\"Otro\",$A$1,VLOOKUP(N9, INDIRECT(A9),2,FALSE))","v":0.15},0.4,null,{"$f":"IF(O9=\"Valor:\",M9*P9,M9*O9)","v":75},{"$f":"M9-R9","v":425}]
[null,null,null,null,null,null,null,null,null,null,null,null,null,null,null,null,null,{"$f":"SUM(R3:R9)","v":39778.400000000001},{"$f":"SUM(S3:S9)","v":129551.6},null,{"$f":"R10/(R10+S10)","v":0.23491643536290086}]
[]
[null,null,null,null,null,null,"ESTRUCTURA",null,"m3",null,null,"d","kg",null,"% reciclado",null,null,"Material\nReciclado\n[Kg]","Material\nno Reciclado\n[Kg]",null,"Material Reciclado\n[%]"]
["CALCULO_EDIF!C174:D7",{"$f":"IF(D13=1,1,(D13-1)*25)","v":150},174,7,{"$f":"CONCATENATE(\"CALCULO_EDIF!\",\"C\",B13,\":\",\"C\",C13)","v":"CALCULO_EDIF!C150:C174"},null,"ACERO","pilares, vigas y viguetas",15,null,null,7800,{"$f":"IF(AND(ISBLANK(I13)*ISBLANK(K13)),\"-\",IF(AND(NOT(ISBLANK(I13))*NOT(ISBLANK(K13))),\"Error\",IF(ISBLANK(I13),K13,I13*L13)))","v":117000},"Barras y perfiles-ArcelorMittal",{"$f":"IF(N13=\"Otro\",$A$1,VLOOKUP(N13, INDIRECT(A13),2,FALSE))","v":0.88980000000000004},0.4,null,{"$f":"IF(O13=\"Valor:\",M13*P13,M13*O13)","v":104106.6},{"$f":"M13-R13","v":12893.399999999994},null,{"$f":"SUM(R13:R14)/SUM(M13:M14)","v":0.88967356007520082}]
["CALCULO_EDIF!C199:D8",{"$f":"IF(D14=1,1,(D14-1)*25)","v":175},199,8,"CALCULO_EDIF!C175:C199",null,null,"chapa metálica",null,null,20,7800,{"$f":"IF(AND(ISBLANK(I14)*ISBLANK(K14)),\"-\",IF(AND(NOT(ISBLANK(I14))*NOT(ISBLANK(K14))),\"Error\",IF(ISBLANK(I14),K14,I14*L14)))","v":20},"material n03",{"$f":"IF(N14=\"Otro\",$A$1,VLOOKUP(N14, INDIRECT(A14),2,FALSE))","v":0.15},0.4,null,{"$f":"IF(O14=\"Valor:\",M14*P14,M14*O14)","v":3},{"$f":"M14-R14","v":17}]
[]
{"$rows_left_out":158}
{"sheet":"entrada datos Urbanizacion","index":3,"n_rows":90,"n_cols":21,"rows_kept":90,"cut":false,"hidden":false,"merged":[[84,20,88,20],[34,20,36,20],[65,20,70,20],[72,20,82,20],[24,20,26,20],[28,20,32,20],[58,20,61,20],[38,20,56,20],[1,14,1,15],[4,20,7,20],[9,20,13,20],[15,20,18,20],[23,14,23,15]]}
["Valor:"]
[null,"fila empieza","Fila termina","Lista asociada","Para poner en la lista",null,"APLICACIONES NO LIGADAS",null,"m3","o","Kg","d","kg","Material seleccionado","% reciclado",null,null,"Material\nReciclado\n[Kg]","Material\nno Reciclado\n[Kg]",null,"Material Reciclado\n[%]"]
[{"$f":"CONCATENATE(\"CALCULO_EDIF!\",\"C\",C3,\":\",\"D\",D3)","v":"CALCULO_EDIF!C3299:D132"},{"$f":"IF(D3=1,1,(D3-1)*25)","v":3275},{"$f":"IF(D3=1,24,B3+24)","v":3299},132,{"$f":"CONCATENATE(\"CALCULO_EDIF!\",\"C\",B3,\":\",\"C\",C3)","v":"CALCULO_EDIF!C3275:C3299"},null,"DRENAJE","drenaje de grava",5,null,null,1800,{"$f":"IF(AND(ISBLANK(I3)*ISBLANK(K3)),\"-\",IF(AND(NOT(ISBLANK(I3))*NOT(ISBLANK(K3))),\"Error\",IF(ISBLANK(I3),K3,I3*L3)))","v":9000},"material n03",{"$f":"IF(N3=\"Otro\",$A$1,VLOOKUP(N3, INDIRECT(A3),2,FALSE))","v":0.15},0.4,null,{"$f":"IF(O3=\"Valor:\",M3*P3,M3*O3)","v":1350},{"$f":"M3-R3","v":7650},null,{"$f":"SUM(R3:R3)/SUM(M3:M3)","v":0.15}]
[]
[{"$f":"CONCATENATE(\"CALCULO_EDIF!\",\"C\",C5,\":\",\"D\",D5)","v":"CALCULO_EDIF!C3324:D133"},3300,{"$f":"IF(D5=1,24,B5+24)","v":3324},133,{"$f":"CONCATENATE(\"CALCULO_EDIF!\",\"C\",B5,\":\",\"C\",C5)","v":"CALCULO_EDIF!C3300:C3324"},null,"MOVIMIENTO E TIERRAS","material de explanadas",null,null,20,2500,{"$f":"IF(AND(ISBLANK(I5)*ISBLANK(K5)),\"-\",IF(AND(NOT(ISBLANK(I5))*NOT(ISBLANK(K5))),\"Error\",IF(ISBLANK(I5),K5,I5*L5)))","v":20},"material n04",{"$f":"IF(N5=\"Otro\",$A$1,VLOOKUP(N5, INDIRECT(A5),2,FALSE))","v":0.2},0.4,null,{"$f":"IF(O5=\"Valor:\",M5*P5,M5*O5)","v":4},{"$f":"M5-R5","v":16},null,{"$f":"SUM(R5:R8)/SUM(M5:M8)","v":0.10109278350515465}]
["CALCULO_EDIF!C3349:D134",3325,3349,134,"CALCULO_EDIF!C3325:C3349",null,null,"material de terraplenes o afines",null,null,10,2500,{"$f":"IF(AND(ISBLANK(I6)*ISBLANK(K6)),\"-\",IF(AND(NOT(ISBLANK(I6))*NOT(ISBLANK(K6))),\"Error\",IF(ISBLANK(I6),K6,I6*L6)))","v":10},"Otro",{"$f":"IF(N6=\"Otro\",$A$1,VLOOKUP(N6, INDIRECT(A6),2,FALSE))","v":"Valor:"},0.23,null,{"$f":"IF(O6=\"Valor:\",M6*P6,M6*O6)","v":2.3000000000000003},{"$f":"M6-R6","v":7.6999999999999993}]
[{"$f":"CONCATENATE(\"CALCULO_EDIF!\",\"C\",C7,\":\",\"D\",D7)","v":"CALCULO_EDIF!C3374:D135"},{"$f":"IF(D7=1,1,(D7-1)*25)","v":3350},{"$f":"IF(D7=1,24,B7+24)","v":3374},135,{"$f":"CONCATENATE(\"CALCULO_EDIF!\",\"C\",B7,\":\",\"C\",C7)","v":"CALCULO_EDIF!C3350:C3374"},null,null,"material para urbanizaciones y rellenos",null,null,20,2500,{"$f":"IF(AND(ISBLANK(I7)*ISBLANK(K7)),\"-\",IF(AND(NOT(ISBLANK(I7))*NOT(ISBLANK(K7))),\"Error\",IF(ISBLANK(I7),K7,I7*L7)))","v":20},"material n04",{"$f":"IF(N7=\"Otro\",$A$1,VLOOKUP(N7, INDIRECT(A7),2,FALSE))","v":0.2},0.4,null,{"$f":"IF(O7=\"Valor:\",M7*P7,M7*O7)","v":4},{"$f":"M7-R7","v":16}]
["CALCULO_EDIF!C3399:D136",3375,3399,136,"CALCULO_EDIF!C3375:C3399",null,null,"zanjas y pozos",3,null,null,1600,{"$f":"IF(AND(ISBLANK(I8)*ISBLANK(K8)),\"-\",IF(AND(NOT(ISBLANK(I8))*NOT(ISBLANK(K8))),\"Error\",IF(ISBLANK(I8),K8,I8*L8)))","v":4800},"material n02",{"$f":"IF(N8=\"Otro\",$A$1,VLOOKUP(N8, INDIRECT(A8),2,FALSE))","v":0.1},0.4,null,{"$f":"IF(O8=\"Valor:\",M8*P8,M8*O8)","v":480},{"$f":"M8-R8","v":4320}]
[]
["CALCULO_EDIF!C3424:D137",{"$f":"IF(D10=1,1,(D10-1)*25)","v":3400},{"$f":"IF(D10=1,24,B10+24)","v":3424},137,"CALCULO_EDIF!C3400:C3424",null,"SUBBASES","granular",null,null,59,1800,{"$f":"IF(AND(ISBLANK(I10)*ISBLANK(K10)),\"-\",IF(AND(NOT(ISBLANK(I10))*NOT(ISBLANK(K10))),\"Error\",IF(ISBLANK(I10),K10,I10*L10)))","v":59},"material n05",{"$f":"IF(N10=\"Otro\",$A$1,VLOOKUP(N10, INDIRECT(A10),2,FALSE))","v":0.25},0.4,null,{"$f":"IF(O10=\"Valor:\",M10*P10,M10*O10)","v":14.75},{"$f":"M10-R10","v":44.25},null,{"$f":"SUM(R10:R14)/SUM(M10:M14)","v":0.25206806456612713}]
["CALCULO_EDIF!C3449:D138",3425,3449,138,"CALCULO_EDIF!C3425:C3449",null,null,"suelo-cemento",null,null,58,1800,{"$f":"IF(AND(ISBLANK(I11)*ISBLANK(K11)),\"-\",IF(AND(NOT(ISBLANK(I11))*NOT(ISBLANK(K11))),\"Error\",IF(ISBLANK(I11),K11,I11*L11)))","v":58},"material n04",{"$f":"IF(N11=\"Otro\",$A$1,VLOOKUP(N11, INDIRECT(A11),2,FALSE))","v":0.2},0.4,null,{"$f":"IF(O11=\"Valor:\",M11*P11,M11*O11)","v":11.600000000000001},{"$f":"M11-R11","v":46.4}]
["CALCULO_EDIF!C3474:D139",3450,3474,139,"CALCULO_EDIF!C3450:C3474",null,null,"grava-emulsión",45,null,null,1900,{"$f":"IF(AND(ISBLANK(I12)*ISBLANK(K12)),\"-\",IF(AND(NOT(ISBLANK(I12))*NOT(ISBLANK(K12))),\"Error\",IF(ISBLANK(I12),K12,I12*L12)))","v":85500},"Otro",{"$f":"IF(N12=\"Otro\",$A$1,VLOOKUP(N12, INDIRECT(A12),2,FALSE))","v":"Valor:"},0.31,null,{"$f":"IF(O12=\"Valor:\",M12*P12,M12*O12)","v":26505},{"$f":"M12-R12","v":58995}]
["CALCULO_EDIF!C3499:D140",3475,3499,140,"CALCULO_EDIF!C3475:C3499",null,null,"grava-cemento",50,null,null,1900,{"$f":"IF(AND(ISBLANK(I13)*ISBLANK(K13)),\"-\",IF(AND(NOT(ISBLANK(I13))*NOT(ISBLANK(K13))),\"Error\",IF(ISBLANK(I13),K13,I13*L13)))","v":95000},"material n04",{"$f":"IF(N13=\"Otro\",$A$1,VLOOKUP(N13, INDIRECT(A13),2,FALSE))","v":0.2},0.4,null,{"$f":"IF(O13=\"Valor:\",M13*P13,M13*O13)","v":19000},{"$f":"M13-R13","v":76000}]
["CALCULO_EDIF!C3524:D141",3500,3524,141,"CALCULO_EDIF!C3500:C3524",null,null,"sablón",null,null,35,1500,{"$f":"IF(AND(ISBLANK(I14)*ISBLANK(K14)),\"-\",IF(AND(NOT(ISBLANK(I14))*NOT(ISBLANK(K14))),\"Error\",IF(ISBLANK(I14),K14,I14*L14)))","v":35},"material n03",{"$f":"IF(N14=\"Otro\",$A$1,VLOOKUP(N14, INDIRECT(A14),2,FALSE))","v":0.15},0.4,null,{"$f":"IF(O14=\"Valor:\",M14*P14,M14*O14)","v":5.25},{"$f":"M14-R14","v":29.75}]
[]
{"$rows_left_out":76}
{"sheet":"resultados","index":4,"n_rows":44,"n_cols":8,"rows_kept":44,"cut":false,"hidden":false,"merged":[]}
[]
[]
[]
[]
[null,"EDIFICACIÓN",null,"Material\nReciclado\n[Kg]","Material\nno Reciclado\n[Kg]",null,"Material Reciclado\n[%]"]
[null,"ACONDICIONAMIENTO Y CIMENTACIÓN",null,{"$f":"'entrada datos Edificación'!R10","v":39778.400000000001},{"$f":"'entrada datos Edificación'!S10","v":129551.6},null,{"$f":"D6/(D6+E6)","v":0.23491643536290086}]
[null,"ESTRUCTURA",null,{"$f":"'entrada datos Edificación'!R25","v":109291.08929999999},{"$f":"'entrada datos Edificación'!S25","v":24886.910699999993},null,{"$f":"D7/(D7+E7)","v":0.8145231654965791}]
[null,"FACHADAS",null,{"$f":"'entrada datos Edificación'!R57","v":52963.75},{"$f":"'entrada datos Edificación'!S57","v":66340.25},null,0.44393943203916048]
[null,"CUBIERTAS",null,{"$f":"'entrada datos Edificación'!R77","v":12896.900000000001},{"$f":"'entrada datos Edificación'!S77","v":8405.0999999999985},null,0.60543141489062069]
[null,"AISLANTES E IMPERMEABILIZANTES",null,{"$f":"'entrada datos Edificación'!R93","v":674.09},{"$f":"'entrada datos Edificación'!S93","v":1521.9100000000003},null,0.30696265938069212]
[null,"PARTICIONES INTERIORES",null,{"$f":"'entrada datos Edificación'!R110","v":32435.79},{"$f":"'entrada datos Edificación'!S110","v":114719.20999999999},null,0.22041921783153817]
[null,"REVESTIMIENTOS",null,{"$f":"'entrada datos Edificación'!R139","v":71038.19},{"$f":"'entrada datos Edificación'!S139","v":206249.80999999997},null,0.25618919679178326]
[null,"INSTALACIONES",null,{"$f":"'entrada datos Edificación'!R172","v":8439.625},{"$f":"'entrada datos Edificación'!S172","v":75960.375},null,9.9995556872037913E-2]
[]
[null,"TOTAL EDIFICACIÓN",null,{"$f":"SUM(D6:D13)","v":327517.83429999999},{"$f":"SUM(E6:E13)","v":627635.1656999999},null,{"$f":"D15/(D15+E15)","v":0.34289567671357368}]
{"$rows_left_out":30}
{"sheet":"CALCULO_EDIF","index":5,"n_rows":5071,"n_cols":6,"rows_kept":5071,"cut":false,"hidden":true,"merged":[[5049,0,5073,0],[5049,1,5073,1],[4974,0,4998,0],[4974,1,4998,1],[4999,0,5023,0],[4999,1,5023,1],[5024,0,5048,0],[5024,1,5048,1],[4849,0,4873,0],[4849,1,4873,1],[4874,0,4898,0],[4874,1,4898,1],[4899,0,4923,0],[4899,1,4923,1],[4924,0,4948,0],[4924,1,4948,1],[4949,0,4973,0],[4949,1,4973,1],[4249,0,4273,0],[4274,0,4298,0],[4299,0,4323,0],[4324,0,4348,0],[0,1,23,1],[24,1,48,1],[49,1,73,1],[74,1,98,1],[99,1,123,1],[124,1,148,1],[149,1,173,1],[174,1,198,1],[199,1,223,1],[224,1,248,1],[274,1,298,1],[299,1,323,1],[324,1,348,1],[349,1,373,1],[4024,0,4048,0],[4049,0,4073,0],[4074,0,4098,0],[4099,0,4123,0],[4124,0,4148,0],[4149,0,4173,0],[3774,0,3798,0],[3799,0,3823,0],[4174,0,4198,0],[4199,0,4223,0],[4224,0,4248,0],[3824,0,3848,0],[3849,0,3873,0],[3874,0,3898,0],[3899,0,3923,0],[3924,0,3948,0],[3949,0,3973,0],[3974,0,3998,0],[3999,0,4023,0],[3549,0,3573,0],[3574,0,3598,0],[3599,0,3623,0],[3624,0,3648,0],[3649,0,3673,0],[3674,0,3698,0],[3699,0,3723,0],[3724,0,3748,0],[3749,0,3773,0],[3324,0,3348,0],[3349,0,3373,0],[3374,0,3398,0],[3399,0,3423,0],[3424,0,3448,0],[3449,0,3473,0],[3474,0,3498,0],[3499,0,3523,0],[3524,0,3548,0],[2449,0,2473,0],[2474,0,2498,0],[2499,0,2523,0],[2524,0,2548,0],[2549,0,2573,0],[2574,0,2598,0],[2599,0,2623,0],[3274,0,3298,0],[3299,0,3323,0],[2624,0,2648,0],[2649,0,2673,0],[2674,0,2698,0],[2699,0,2723,0],[2724,0,2748,0],[2749,0,2773,0],[2774,0,2798,0],[2799,0,2823,0],[2824,0,2848,0],[2849,0,2873,0],[2874,0,2898,0],[2899,0,2923,0],[2924,0,2948,0],[2949,0,2973,0],[2974,0,2998,0],[2224,0,2248,0],[2249,0,2273,0],[2274,0,2298,0],[2299,0,2323,0],[2324,0,2348,0],[2349,0,2373,0],[2374,0,2398,0],[2399,0,2423,0],[2424,0,2448,0],[1974,0,1998,0],[1999,0,2023,0],[2024,0,2048,0],[2049,0,2073,0],[2099,0,2123,0],[2124,0,2148,0],[2149,0,2173,0],[2174,0,2198,0],[2199,0,2223,0],[2074,0,2098,0],[1749,0,1773,0],[1774,0,1798,0],[1799,0,1823,0],[1824,0,1848,0],[1849,0,1873,0],[1874,0,1898,0],[1899,0,1923,0],[1924,0,1948,0],[1949,0,1973,0],[1524,0,1548,0],[1549,0,1573,0],[1574,0,1598,0],[1599,0,1623,0],[1624,0,1648,0],[1649,0,1673,0],[1674,0,1698,0],[1699,0,1723,0],[1724,0,1748,0],[1299,0,1323,0],[1324,0,1348,0],[1349,0,1373,0],[1374,0,1398,0],[1399,0,1423,0],[1424,0,1448,0],[1449,0,1473,0],[1474,0,1498,0],[1499,0,1523,0],[1074,0,1098,0],[1099,0,1123,0],[1124,0,1148,0],[1149,0,1173,0],[1174,0,1198,0],[1199,0,1223,0],[1224,0,1248,0],[1249,0,1273,0],[1274,0,1298,0],[849,0,873,0],[874,0,898,0],[899,0,923,0],[924,0,948,0],[949,0,973,0],[974,0,998,0],[999,0,1023,0],[1024,0,1048,0],[1049,0,1073,0],[624,0,648,0],[649,0,673,0],[674,0,698,0],[699,0,723,0],[724,0,748,0],[749,0,773,0],[774,0,798,0],[799,0,823,0],[824,0,848,0],[399,0,423,0],[424,0,448,0],[449,0,473,0],[474,0,498,0],[499,0,523,0],[524,0,548,0],[549,0,573,0],[574,0,598,0],[599,0,623,0],[0,0,23,0],[24,0,48,0],[49,0,73,0],[74,0,98,0],[99,0,123,0],[124,0,148,0],[149,0,173,0],[174,0,198,0],[374,1,398,1],[199,0,223,0],[224,0,248,0],[274,0,298,0],[299,0,323,0],[324,0,348,0],[349,0,373,0],[374,0,398,0],[249,0,273,0],[249,1,273,1],[399,1,423,1],[424,1,448,1],[449,1,473,1],[474,1,498,1],[499,1,523,1],[524,1,548,1],[549,1,573,1],[574,1,598,1],[599,1,623,1],[624,1,648,1],[649,1,673,1],[674,1,698,1],[699,1,723,1],[724,1,748,1],[749,1,773,1],[774,1,798,1],[799,1,823,1],[824,1,848,1],[849,1,873,1],[874,1,898,1],[899,1,923,1],[924,1,948,1],[949,1,973,1],[974,1,998,1],[999,1,1023,1],[1024,1,1048,1],[1049,1,1073,1],[1074,1,1098,1],[1099,1,1123,1],[1124,1,1148,1],[1149,1,1173,1],[1174,1,1198,1],[1199,1,1223,1],[1224,1,1248,1],[1249,1,1273,1],[1274,1,1298,1],[1299,1,1323,1],[1324,1,1348,1],[1349,1,1373,1],[1374,1,1398,1],[1399,1,1423,1],[1424,1,1448,1],[1449,1,1473,1],[1474,1,1498,1],[1499,1,1523,1],[1524,1,1548,1],[1549,1,1573,1],[1574,1,1598,1],[1599,1,1623,1],[1624,1,1648,1],[1649,1,1673,1],[1674,1,1698,1],[1699,1,1723,1],[1724,1,1748,1],[1749,1,1773,1],[1774,1,1798,1],[1799,1,1823,1],[1824,1,1848,1],[1849,1,1873,1],[1874,1,1898,1],[1899,1,1923,1],[1924,1,1948,1],[1949,1,1973,1],[1974,1,1998,1],[1999,1,2023,1],[2024,1,2048,1],[2049,1,2073,1],[2099,1,2123,1],[2124,1,2148,1],[2149,1,2173,1],[2174,1,2198,1],[2199,1,2223,1],[2074,1,2098,1],[2224,1,2248,1],[2249,1,2273,1],[2274,1,2298,1],[2299,1,2323,1],[2324,1,2348,1],[2349,1,2373,1],[2374,1,2398,1],[2399,1,2423,1],[2424,1,2448,1],[2449,1,2473,1],[2474,1,2498,1],[2499,1,2523,1],[2524,1,2548,1],[2549,1,2573,1],[2574,1,2598,1],[2599,1,2623,1],[3274,1,3298,1],[3299,1,3323,1],[2624,1,2648,1],[2649,1,2673,1],[2674,1,2698,1],[2699,1,2723,1],[2724,1,2748,1],[2749,1,2773,1],[2774,1,2798,1],[2799,1,2823,1],[2824,1,2848,1],[2849,1,2873,1],[2874,1,2898,1],[2899,1,2923,1],[2924,1,2948,1],[2949,1,2973,1],[2974,1,2998,1],[3324,1,3348,1],[3349,1,3373,1],[3374,1,3398,1],[3574,1,3598,1],[3599,1,3623,1],[3624,1,3648,1],[3399,1,3423,1],[3424,1,3448,1],[3449,1,3473,1],[3474,1,3498,1],[3499,1,3523,1],[3524,1,3548,1],[3549,1,3573,1],[3649,1,3673,1],[3674,1,3698,1],[3699,1,3723,1],[3724,1,3748,1],[3749,1,3773,1],[3774,1,3798,1],[3799,1,3823,1],[3824,1,3848,1],[3849,1,3873,1],[3874,1,3898,1],[3899,1,3923,1],[3924,1,3948,1],[3949,1,3973,1],[3974,1,3998,1],[3999,1,4023,1],[4024,1,4048,1],[4049,1,4073,1],[4299,1,4323,1],[4324,1,4348,1],[4074,1,4098,1],[4099,1,4123,1],[4124,1,4148,1],[4149,1,4173,1],[4174,1,4198,1],[4199,1,4223,1],[4224,1,4248,1],[4249,1,4273,1],[4274,1,4298,1],[4349,0,4373,0],[4349,1,4373,1],[4374,0,4398,0],[4374,1,4398,1],[4399,0,4423,0],[4399,1,4423,1],[4424,0,4448,0],[4424,1,4448,1],[4449,0,4473,0],[4449,1,4473,1],[4474,0,4498,0],[4474,1,4498,1],[4499,0,4523,0],[4499,1,4523,1],[4524,0,4548,0],[4524,1,4548,1],[4549,0,4573,0],[4549,1,4573,1],[4574,0,4598,0],[4574,1,4598,1],[4599,0,4623,0],[4599,1,4623,1],[4624,0,4648,0],[4624,1,4648,1],[4649,0,4673,0],[4649,1,4673,1],[4674,0,4698,0],[4674,1,4698,1],[4699,0,4723,0],[4699,1,4723,1],[4724,0,4748,0],[4724,1,4748,1],[4749,0,4773,0],[4749,1,4773,1],[4774,0,4798,0],[4774,1,4798,1],[4799,0,4823,0],[4799,1,4823,1],[4824,0,4848,0],[4824,1,4848,1],[2999,0,3023,0],[2999,1,3023,1],[3024,0,3048,0],[3024,1,3048,1],[3049,0,3073,0],[3049,1,3073,1],[3074,0,3098,0],[3074,1,3098,1],[3224,0,3248,0],[3224,1,3248,1],[3249,0,3273,0],[3249,1,3273,1],[3099,0,3123,0],[3099,1,3123,1],[3124,0,3148,0],[3124,1,3148,1],[3149,0,3173,0],[3149,1,3173,1],[3174,0,3198,0],[3174,1,3198,1],[3199,0,3223,0],[3199,1,3223,1]]}
[1,{"$f":"\"Lista  \"  &A1& \"  \"& LOOKUP(A1,'entrada datos Edificación'!$D$3:$D$138,'entrada datos Edificación'!$H$3:$H$138)","v":"Lista  1  hormigón zapatas y pilotes"},"Sin materiall reciclado ",0]
[null,null,"Cemento CEM I-Cementos Lemona, S.A. ",0.03]
[null,null,"Cemento CEM I-Cementos Molins Industrial, S.A. ",0.03]
[null,null,"Cemento CEM I-Cementos Portland Valderrivas, S.A. ",0.03]
[null,null,"Cemento CEM I- Cementos Tudela Veguín, S.A. ",0.03]
[null,null,"Cemento CEM I-CEMEX España Operaciones, S.L.U. ",0.03]
[null,null,"Cemento CEM I-Holcim España, S.A. ",0.03]
[null,null,"Cemento CEM I-Grupo Votorantim. ",0.03]
[null,null,"Cemento CEM I-Lafarge Cementos, S.A.U. ",0.03]
[null,null,"Cemento CEM I-Sociedad Financiera y Minera, S.A",0.03]
[null,null,"Cemento CEM II-Cementos Balboa, S.A. ",0.03]
[null,null,"Cemento CEM II-Cementos Lemona, S.A. ",0.03]
[null,null,"Cemento CEM II-Cementos Molins Industrial, S.A. ",0.03]
[null,null,"Cemento CEM II-Cementos Portland Valderrivas, S.A. ",0.03]
[null,null,"Cemento CEM II-Cementos Tudela Veguín, S.A. ",0.03]
{"$rows_left_out":5056}