{"text_format":"1","workbook":"xlsx","n_sheets":11,"sheets":["T","DE","Tipo Vehículo","Características Vehículo","Costes Adquisición","Costes Personal","Seguros y Costes Fiscales","Costes Variables","Costes Indirectos","Resultados","Coste Servicio"],"not_rendered":{"charts":6,"images":6,"macros":1,"external_links":1,"defined_names":5,"comments":1,"pivot_tables":0},"unopened":[],"bounds":{"document_bytes":16777216,"sheet_cells":100000,"rows_first":2000,"rows_last":500,"rows_between":2000,"halvings":0,"cell_chars":16384,"cell_head_chars":4096},"cells_cut":0,"cells_raw":0,"read":"whole","date_system":"1900"}

{"sheet":"T","index":0,"n_rows":17,"n_cols":8,"rows_kept":17,"cut":false,"hidden":true,"merged":[]}
["Tipo de vehículo",null,"Pregunta",null,null,"Adquisicion",null,"Editable"]
["Vehículo articulado de carga general de larga distancia","T1","Si","S",null,"COMPRA"]
["Vehículo articulado de carga general de corta distancia","T2","No","N",null,"ALQUILER, LEASING…"]
["Portacontenedores de larga distancia","T3"]
["Portacontenedores de corta distancia","T4"]
["Volquete articulado de obra","T5"]
["Vehículo de 2 ejes de carga general","T6"]
["Vehículo articulado de mercancías peligrosas (químicas) de larga distancia","T7"]
["Vehículo articulado de productos derivados del petróleo (gasoil, gasolina, fueloil)","T8"]
["Vehículo cisterna de mercancías peligrosas (gases) de larga distancia","T9"]
["Vehículo frigorífico articulado","T10"]
["Vehículo frigorífico de 2 ejes","T11"]
["Volquete graneles de larga distancia","T12"]
["Volquete graneles de corta distancia","T13"]
["Camión ligero 3T distribución","T14"]
["Furgonetas","T15"]
["Vehículo genérico (para todos aquellos vehículos que no puedan ser englobados en las categorías anteriores)","T16"]

{"sheet":"DE","index":1,"n_rows":125,"n_cols":36,"rows_kept":125,"cut":false,"hidden":true,"merged":[]}
[null,null,null,"T1A","T1","T2A","T2","T3A","T3","T4A","T4","T5A","T5","T6A","T6","T7A","T7","T8A","T8","T9A","T9","T10A","T10","T11A","T11","T12A","T12","T13A","T13","T14A","T14","T15A","T15","T16A","T16"]
[null,"Descripción:",null," ","Vehículo articulado de carga general de larga distancia"," ","Vehículo articulado de carga general de corta distancia"," ","Portacontenedores de larga distancia"," ","Portacontenedores de corta distancia"," ","Volquete articulado de obra"," ","Vehículo de 2 ejes de carga general"," ","Vehículo articulado de mercancías peligrosas (químicas) de larga distancia"," ","Vehículo articulado de productos derivados del petróleo (gasoil, gasolina, fueloil)"," ","Vehículo cisterna de mercancías peligrosas (gases) de larga distancia"," ","Vehículo frigorífico articulado"," ","Vehículo frigorífico de 2 ejes"," ","Volquete graneles de larga distancia"," ","Volquete graneles de corta distancia"," ","Camión ligero 3T distribución"," ","Furgonetas"," ","Vehículo genérico (para todos aquellos vehículos que no puedan ser englobados en las categorías anteriores)","22/01/2024"]
[null,"Tipo interes",null,null,0.0534,null,0.0534,null,0.0534,null,0.0534,null,0.0534,null,0.0534,null,0.0534,null,0.0534,null,0.0534,null,0.0534,null,0.0534,null,0.0534,null,0.0534,null,0.0534,null,0.0534,null,0.0534]
[null,"Potencia",null,null,455.0,null,455.0,null,455.0,null,455.0,null,455.0,null,280.0,null,455.0,null,455.0,null,455.0,null,455.0,null,280.0,null,455.0,null,455.0,null,130.0,null,130.0,null,455.0]
[null,"MMA",null,null,40000.0,null,40000.0,null,44000.0,null,44000.0,null,40000.0,null,18000.0,null,40000.0,null,40000.0,null,40000.0,null,40000.0,null,18000.0,null,40000.0,null,40000.0,null,35000.0,null,3500.0,null,40000.0]
[null,"Carga útil",null,null,25000.0,null,25000.0,null,26250.0,null,26250.0,null,23000.0,null,9500.0,null,0.0,null,0.0,null,0.0,null,24000.0,null,9000.0,null,24000.0,null,24000.0,null,1500.0,null,1500.0,null,25000.0]
[null,"Número de ejes",null,null,5.0,null,5.0,null,6.0,null,6.0,null,4.0,null,2.0,null,5.0,null,5.0,null,5.0,null,5.0,null,2.0,null,5.0,null,5.0,null,2.0,null,2.0,null,5.0]
[null,"Número de neumáticos",null,null,12.0,null,12.0,null,14.0,null,14.0,null,14.0,null,6.0,null,12.0,null,12.0,null,12.0,null,12.0,null,6.0,null,12.0,null,12.0,null,4.0,null,4.0,null,12.0]
[null,"Kilómetros recorridos anualmente",null,null,150000.0,null,120000.0,null,100000.0,null,100000.0,null,60000.0,null,90000.0,null,105000.0,null,100000.0,null,100000.0,null,120000.0,null,70000.0,null,120000.0,null,120000.0,null,50000.0,null,50000.0,null,120000.0]
[null,"Kilómetros recorridos anualmente en carga (%, km)",null,90.0,{"$f":"E9*D10/100","v":135000.0},85.0,{"$f":"G9*F10/100","v":102000.0},85.0,{"$f":"I9*H10/100","v":85000.0},85.0,85000.0,50.0,{"$f":"M9*L10/100","v":30000.0},80.0,{"$f":"O9*N10/100","v":72000.0},75.0,{"$f":"Q9*P10/100","v":78750.0},50.0,{"$f":"S9*R10/100","v":50000.0},50.0,50000.0,80.0,{"$f":"W9*V10/100","v":96000.0},75.0,{"$f":"Y9*X10/100","v":52500.0},80.0,{"$f":"AA9*Z10/100","v":96000.0},80.0,96000.0,75.0,{"$f":"AE9*AD10/100","v":37500.0},75.0,{"$f":"AG9*AF10/100","v":37500.0},85.0,{"$f":"AI9*AH10/100","v":102000.0}]
[null,"Kilómetros recorridos anualmente en vacío (%, km)",null,10.0,{"$f":"E9*D11/100","v":15000.0},15.0,{"$f":"G9*F11/100","v":18000.0},15.0,{"$f":"I9*H11/100","v":15000.0},15.0,{"$f":"K9*J11/100","v":15000.0},50.0,{"$f":"M9*L11/100","v":30000.0},20.0,{"$f":"O9*N11/100","v":18000.0},25.0,{"$f":"Q9*P11/100","v":26250.0},50.0,{"$f":"S9*R11/100","v":50000.0},50.0,{"$f":"U9*T11/100","v":50000.0},20.0,{"$f":"W9*V11/100","v":24000.0},25.0,{"$f":"Y9*X11/100","v":17500.0},20.0,{"$f":"AA9*Z11/100","v":24000.0},20.0,{"$f":"AC9*AB11/100","v":24000.0},25.0,{"$f":"AE9*AD11/100","v":12500.0},25.0,{"$f":"AG9*AF11/100","v":12500.0},15.0,{"$f":"AI9*AH11/100","v":18000.0}]
[null,"Consumo medio (litros/100km)",null,null,35.0,null,35.0,null,35.0,null,35.0,null,38.5,null,25.0,null,34.5,null,34.5,null,34.5,null,35.0,null,25.0,null,35.0,null,35.0,null,11.5,null,11.5,null,35.0]
[null,"Horas trabajadas al año",null,null,2000.0,null,1800.0,null,1800.0,null,1800.0,null,1800.0,null,1800.0,null,1800.0,null,1800.0,null,1800.0,null,1800.0,null,1800.0,null,1800.0,null,1800.0,null,1800.0,null,1800.0,null,1800.0]
[null,"Horas trabajadas al año en carga (%, h)",null,90.0,{"$f":"E13*D14/100","v":1800.0},85.0,{"$f":"G13*F14/100","v":1530.0},85.0,{"$f":"I13*H14/100","v":1530.0},85.0,1530.0,50.0,{"$f":"M13*L14/100","v":900.0},80.0,{"$f":"O13*N14/100","v":1440.0},75.0,{"$f":"Q13*P14/100","v":1350.0},50.0,{"$f":"S13*R14/100","v":900.0},50.0,900.0,80.0,{"$f":"W13*V14/100","v":1440.0},75.0,{"$f":"Y13*X14/100","v":1350.0},80.0,{"$f":"AA13*Z14/100","v":1440.0},80.0,1440.0,75.0,{"$f":"AE13*AD14/100","v":1350.0},75.0,{"$f":"AG13*AF14/100","v":1350.0},85.0,{"$f":"AI13*AH14/100","v":1530.0}]
[null,"Horas trabajadas al año en vacío (%, h)",null,10.0,{"$f":"E13*D15/100","v":200.0},15.0,{"$f":"G13*F15/100","v":270.0},15.0,{"$f":"I13*H15/100","v":270.0},15.0,{"$f":"K13*J15/100","v":270.0},50.0,{"$f":"M13*L15/100","v":900.0},20.0,{"$f":"O13*N15/100","v":360.0},25.0,{"$f":"Q13*P15/100","v":450.0},50.0,{"$f":"S13*R15/100","v":900.0},50.0,{"$f":"U13*T15/100","v":900.0},20.0,{"$f":"W13*V15/100","v":360.0},25.0,{"$f":"Y13*X15/100","v":450.0},20.0,{"$f":"AA13*Z15/100","v":360.0},20.0,{"$f":"AC13*AB15/100","v":360.0},25.0,{"$f":"AE13*AD15/100","v":450.0},25.0,{"$f":"AG13*AF15/100","v":450.0},15.0,{"$f":"AI13*AH15/100","v":270.0}]
[null,"Días trabajados al año",null,null,250.0,null,225.0,null,225.0,null,225.0,null,225.0,null,225.0,null,225.0,null,225.0,null,225.0,null,225.0,null,225.0,null,225.0,null,225.0,null,225.0,null,225.0,null,225.0]
[null,"Horas trabajadas por jornada",null,null,{"$f":"E13/E16","v":8.0},null,{"$f":"G13/G16","v":8.0},null,{"$f":"I13/I16","v":8.0},null,8.0,null,{"$f":"M13/M16","v":8.0},null,{"$f":"O13/O16","v":8.0},null,{"$f":"Q13/Q16","v":8.0},null,{"$f":"S13/S16","v":8.0},null,8.0,null,{"$f":"W13/W16","v":8.0},null,{"$f":"Y13/Y16","v":8.0},null,{"$f":"AA13/AA16","v":8.0},null,8.0,null,{"$f":"AE13/AE16","v":8.0},null,{"$f":"AG13/AG16","v":8.0},null,{"$f":"AI13/AI16","v":8.0}]
[null,"Pago de leasing o renta anual (€)",null,null,0.0,null,0.0,null,0.0,null,0.0,null,0.0,null,0.0,null,0.0,null,0.0,null,0.0,null,0.0,null,0.0,null,0.0,null,0.0,null,0.0,null,0.0,null,0.0]
[null,"Precio de tarifa sin IVA (€)",null,null,124387.3,null,124387.3,null,124387.3,null,124387.3,null,124387.3,null,76916.1,null,124387.3,null,124387.3,null,124387.3,null,124387.3,null,76916.1,null,124387.3,null,124387.3,null,26034.19,null,26034.19,null,124387.3]
[null,"Descuento sobre tarifa (%)",null,null,10.0,null,10.0,null,10.0,null,10.0,null,10.0,null,10.0,null,10.0,null,10.0,null,10.0,null,10.0,null,10.0,null,10.0,null,10.0,null,10.0,null,10.0,null,10.0]
{"$rows_left_out":106}
{"sheet":"Tipo Vehículo","index":2,"n_rows":12,"n_cols":6,"rows_kept":12,"cut":false,"hidden":false,"merged":[]}
[]
[]
[]
[]
[]
[null,null,"Seleccionar tipo de vehículo"]
[]
[]
[]
[null,null,"Tipo de vehículo:",null,{"$f":"VLOOKUP(F10,T!A2:B17,2,0)","v":"T16"},"Vehículo genérico (para todos aquellos vehículos que no puedan ser englobados en las categorías anteriores)"]
[]
[null,null,"¿Desea comenzar la simulación con los datos estadísticos añadidos a los formularios de cálculo?"]

{"sheet":"Características Vehículo","index":3,"n_rows":41,"n_cols":13,"rows_kept":41,"cut":false,"hidden":false,"merged":[[10,9,10,13]]}
[]
[]
[]
[]
[]
[null,null,"1. Características del vehículo"]
[]
[]
[null,null,"Características técnicas del vehiculo",null,null,null,null,null,null,null,null,"Datos estadísticos",{"$f":"DE!$AJ$2","v":"08/01/2024"}]
[]
[null,null,"Descripción:",null,null,null,null,null,null,{"$f":"IF(HLOOKUP('Tipo Vehículo'!$E$10,DE!$E$1:$AI$284,2,0)=\"\",\"\",HLOOKUP('Tipo Vehículo'!$E$10,DE!$E$1:$AI$284,2,0))","v":"Vehículo genérico (para todos aquellos vehículos que no puedan ser englobados en las categorías anteriores)"}]
[]
[null,null,"Potencia:",null,null,null,null,null,null,null,null,{"$f":"IF(HLOOKUP('Tipo Vehículo'!$E$10,DE!$D$1:$AI$282,4,0)=\"\",\"\",HLOOKUP('Tipo Vehículo'!$E$10,DE!$D$1:$AI$282,4,0))","v":""}]
[]
[null,null,"MMA (Tm):",null,null,null,null,null,null,null,null,{"$f":"IF(HLOOKUP('Tipo Vehículo'!$E$10,DE!$D$1:$AI$282,5,0)=\"\",\"\",HLOOKUP('Tipo Vehículo'!$E$10,DE!$D$1:$AI$282,5,0))","v":""}]
[]
[null,null,"Carga útil:",null,null,null,null,null,null,null,null,{"$f":"IF(HLOOKUP('Tipo Vehículo'!$E$10,DE!$D$1:$AI$282,6,0)=\"\",\"\",HLOOKUP('Tipo Vehículo'!$E$10,DE!$D$1:$AI$282,6,0))","v":""}]
[]
[null,null,"Número de ejes:",null,null,null,null,null,null,null,null,{"$f":"IF(HLOOKUP('Tipo Vehículo'!$E$10,DE!$D$1:$AI$282,7,0)=\"\",\"\",HLOOKUP('Tipo Vehículo'!$E$10,DE!$D$1:$AI$282,7,0))","v":""}]
[]
{"$rows_left_out":22}
{"sheet":"Costes Adquisición","index":4,"n_rows":105,"n_cols":11,"rows_kept":105,"cut":false,"hidden":false,"merged":[[10,7,10,8],[34,7,34,8],[58,7,58,8],[82,7,82,8]]}
[]
[]
[]
[]
[]
[null,null,"2. Costes de adquisición"]
[]
[]
[null,null,"Vehículo de Tracción",null,null,null,null,null,null,"Datos estadísticos",{"$f":"DE!$AJ$2","v":"08/01/2024"}]
[null,null,null,null,null,null,null,null,null,{"$f":"IF(HLOOKUP('Tipo Vehículo'!$E$10,DE!$D$1:$AX$284,3,0)=\"\",\"\",HLOOKUP('Tipo Vehículo'!$E$10,DE!$D$1:$AX$284,3,0))","v":""}]
[null,null,"Forma de adquisición:",null,null,null,null,"COMPRA"]
[]
[null,null,"Pago de alquiler o leasing anual (€)",null,null,null,null,0,null,{"$f":"IF(HLOOKUP('Tipo Vehículo'!$E$10,DE!$D$1:$AI$282,18,0)=\"\",\"\",HLOOKUP('Tipo Vehículo'!$E$10,DE!$D$1:$AI$282,18,0))","v":""}]
[]
[null,null,"Compra del vehículo de tracción (€) "]
[]
[null,null,"Precio de tarifa sin IVA (€)",null,null,null,null,null,null,{"$f":"IF(HLOOKUP('Tipo Vehículo'!$E$10,DE!$D$1:$AI$282,19,0)=\"\",\"\",HLOOKUP('Tipo Vehículo'!$E$10,DE!$D$1:$AI$282,19,0))","v":""}]
[]
[null,null,"Descuento sobre tarifa (%)",null,null,null,null,null,null,{"$f":"IF(HLOOKUP('Tipo Vehículo'!$E$10,DE!$D$1:$AI$282,20,0)=\"\",\"\",HLOOKUP('Tipo Vehículo'!$E$10,DE!$D$1:$AI$282,20,0))","v":""}]
[]
{"$rows_left_out":86}
{"sheet":"Costes Personal","index":5,"n_rows":23,"n_cols":11,"rows_kept":23,"cut":false,"hidden":false,"merged":[]}
[]
[]
[]
[]
[]
[null,null,"3. Costes de personal"]
[]
[]
[null,null,"Costes de Personal",null,null,null,null,null,null,"Datos estadísticos",{"$f":"DE!$AJ$2","v":"08/01/2024"}]
[]
[null,null,"Coste total anual del conductor, incluidos costes de empresa (Seg. Soc. y otros) €",null,null,null,null,null,null,{"$f":"IF(HLOOKUP('Tipo Vehículo'!$E$10,DE!$D$1:$AI$282,51,0)=\"\",\"\",HLOOKUP('Tipo Vehículo'!$E$10,DE!$D$1:$AI$282,51,0))","v":""}]
[]
[null,null,"Dieta total diaria del conductor (€/día)",null,null,null,null,null,null,{"$f":"IF(HLOOKUP('Tipo Vehículo'!$E$10,DE!$D$1:$AI$282,52,0)=\"\",\"\",HLOOKUP('Tipo Vehículo'!$E$10,DE!$D$1:$AI$282,52,0))","v":""}]
[]
[null,null,"Número de días con dieta al año",null,null,null,null,null,null,{"$f":"IF(HLOOKUP('Tipo Vehículo'!$E$10,DE!$D$1:$AI$282,53,0)=\"\",\"\",HLOOKUP('Tipo Vehículo'!$E$10,DE!$D$1:$AI$282,53,0))","v":""}]
[]
[null,null,"Dietas totales anuales (€)",null,null,null,null,{"$f":"H15*H13","v":0},null,{"$f":"IF(HLOOKUP('Tipo Vehículo'!$E$10,DE!$D$1:$AI$282,54,0)=\"\",\"\",HLOOKUP('Tipo Vehículo'!$E$10,DE!$D$1:$AI$282,54,0))","v":0}]
[]
[null,null,"Plus anual de actividad del conductor (€/km)",null,null,null,null,null,null,{"$f":"IF(HLOOKUP('Tipo Vehículo'!$E$10,DE!$D$1:$AI$282,55,0)=\"\",\"\",HLOOKUP('Tipo Vehículo'!$E$10,DE!$D$1:$AI$282,55,0))","v":""}]
[]
{"$rows_left_out":4}
{"sheet":"Seguros y Costes Fiscales","index":6,"n_rows":49,"n_cols":11,"rows_kept":49,"cut":false,"hidden":false,"merged":[]}
[]
[]
[]
[]
[]
[null,null,"4. Seguros y costes fiscales"]
[]
[]
[null,null,"Seguros",null,null,null,null,null,null,"Datos estadísticos",{"$f":"DE!$AJ$2","v":"08/01/2024"}]
[]
[null,null,"Responsabilidad civil del vehículo de tracción (€)",null,null,null,null,null,null,{"$f":"IF(HLOOKUP('Tipo Vehículo'!$E$10,DE!$D$1:$AI$282,58,0)=\"\",\"\",HLOOKUP('Tipo Vehículo'!$E$10,DE!$D$1:$AI$282,58,0))","v":""}]
[]
[null,null,"Responsabilidad civil del remolque o semirremolque (€)",null,null,null,null,null,null,{"$f":"IF(HLOOKUP('Tipo Vehículo'!$E$10,DE!$D$1:$AI$282,59,0)=\"\",\"\",HLOOKUP('Tipo Vehículo'!$E$10,DE!$D$1:$AI$282,59,0))","v":""}]
[]
[null,null,"Responsabilidad civil de la mercancía (€)",null,null,null,null,null,null,{"$f":"IF(HLOOKUP('Tipo Vehículo'!$E$10,DE!$D$1:$AI$282,60,0)=\"\",\"\",HLOOKUP('Tipo Vehículo'!$E$10,DE!$D$1:$AI$282,60,0))","v":""}]
[]
[null,null,"Accidente del conductor (€)",null,null,null,null,null,null,{"$f":"IF(HLOOKUP('Tipo Vehículo'!$E$10,DE!$D$1:$AI$282,61,0)=\"\",\"\",HLOOKUP('Tipo Vehículo'!$E$10,DE!$D$1:$AI$282,61,0))","v":""}]
[]
[null,null,"Retirada del carné de conducir (€)",null,null,null,null,null,null,{"$f":"IF(HLOOKUP('Tipo Vehículo'!$E$10,DE!$D$1:$AI$282,62,0)=\"\",\"\",HLOOKUP('Tipo Vehículo'!$E$10,DE!$D$1:$AI$282,62,0))","v":""}]
[]
{"$rows_left_out":30}
{"sheet":"Costes Variables","index":7,"n_rows":83,"n_cols":13,"rows_kept":83,"cut":false,"hidden":false,"merged":[]}
[]
[]
[]
[]
[]
[null,null,"5. Costes variables"]
[]
[]
[null,null,"Carburante del vehículo",null,null,null,null,null,null,null,null,"Datos estadísticos",{"$f":"DE!$AJ$2","v":"08/01/2024"}]
[]
[null,null,"Precio del carburante con IVA (€/litro)",null,null,null,null,null,null,null,null,{"$f":"IF(HLOOKUP('Tipo Vehículo'!$E$10,DE!$D$1:$AI$282,77,0)=\"\",\"\",HLOOKUP('Tipo Vehículo'!$E$10,DE!$D$1:$AI$282,77,0))","v":""}]
[]
[null,null,"Descuento (%, €/litro)  ",null,null,null,null,null,"%",{"$f":"IFERROR(ROUND((H13/100)*(J11),2),0)","v":0},{"$f":"IF(HLOOKUP(CONCATENATE('Tipo Vehículo'!$E$10,\"A\"),DE!$D$1:$AI$282,78,0)=\"\",\"\",HLOOKUP(CONCATENATE('Tipo Vehículo'!$E$10,\"A\"),DE!$D$1:$AI$282,78,0))","v":""},{"$f":"IF(HLOOKUP('Tipo Vehículo'!$E$10,DE!$D$1:$AI$282,78,0)=\"\",\"\",HLOOKUP('Tipo Vehículo'!$E$10,DE!$D$1:$AI$282,78,0))","v":0}]
[]
[null,null,"IVA aplicado al carburante (%)  (€/litro)",null,null,null,null,null,"%",{"$f":"IFERROR(ROUND((H15/100)*(J11-J13)/(1+H15/100),2),0)","v":0},{"$f":"IF(HLOOKUP(CONCATENATE('Tipo Vehículo'!$E$10,\"A\"),DE!$D$1:$AI$282,79,0)=\"\",\"\",HLOOKUP(CONCATENATE('Tipo Vehículo'!$E$10,\"A\"),DE!$D$1:$AI$282,79,0))","v":""},{"$f":"IF(HLOOKUP('Tipo Vehículo'!$E$10,DE!$D$1:$AI$282,79,0)=\"\",\"\",HLOOKUP('Tipo Vehículo'!$E$10,DE!$D$1:$AI$282,79,0))","v":0}]
[]
[null,null,"Precio carburante sin IVA (€/litro)",null,null,null,null,null,null,{"$f":"IFERROR(ROUND((J11-J13)/(1+H15/100),2),0)","v":0},null,{"$f":"IF(HLOOKUP('Tipo Vehículo'!$E$10,DE!$D$1:$AI$282,80,0)=\"\",\"\",HLOOKUP('Tipo Vehículo'!$E$10,DE!$D$1:$AI$282,80,0))","v":0}]
[]
[null,null,"GASTO TOTAL ANUAL EN CARBURANTE DEL VEHÍCULO (€)",null,null,null,null,null,null,{"$f":"IFERROR(ROUND(('Características Vehículo'!J25/100)*'Características Vehículo'!J31*J17,0),0)","v":0},null,{"$f":"IF(HLOOKUP('Tipo Vehículo'!$E$10,DE!$D$1:$AI$282,81,0)=\"\",\"\",HLOOKUP('Tipo Vehículo'!$E$10,DE!$D$1:$AI$282,81,0))","v":0}]
[]
{"$rows_left_out":64}
{"sheet":"Costes Indirectos","index":8,"n_rows":17,"n_cols":11,"rows_kept":17,"cut":false,"hidden":false,"merged":[]}
[]
[]
[]
[]
[]
[null,null,"6. Costes indirectos"]
[]
[]
[null,null,"Costes Indirectos",null,null,null,null,null,null,"Datos estadísticos",{"$f":"DE!$AJ$2","v":"08/01/2024"}]
[]
[null,null,"Coste anual estructura(gestión, administración,) repercutible a este vehículo",null,null,null,null,null,null,{"$f":"IF(HLOOKUP('Tipo Vehículo'!$E$10,DE!$D$1:$AI$282,109,0)=\"\",\"\",HLOOKUP('Tipo Vehículo'!$E$10,DE!$D$1:$AI$282,109,0))","v":0}]
[]
[null,null,"Coste anual comercialización repercutible a este vehículo",null,null,null,null,null,null,{"$f":"IF(HLOOKUP('Tipo Vehículo'!$E$10,DE!$D$1:$AI$282,110,0)=\"\",\"\",HLOOKUP('Tipo Vehículo'!$E$10,DE!$D$1:$AI$282,110,0))","v":0}]
[]
[null,null,"Otros costes indirectos anuales repercutibles a este vehículo",null,null,null,null,null,null,{"$f":"IF(HLOOKUP('Tipo Vehículo'!$E$10,DE!$D$1:$AI$282,111,0)=\"\",\"\",HLOOKUP('Tipo Vehículo'!$E$10,DE!$D$1:$AI$282,111,0))","v":0}]
[]
[null,null,"COSTES INDIRECTOS",null,null,null,null,{"$f":"H11+H13+H15","v":0},null,{"$f":"IF(HLOOKUP('Tipo Vehículo'!$E$10,DE!$D$1:$AI$282,112,0)=\"\",\"\",HLOOKUP('Tipo Vehículo'!$E$10,DE!$D$1:$AI$282,112,0))","v":0}]

{"sheet":"Resultados","index":9,"n_rows":97,"n_cols":16,"rows_kept":97,"cut":false,"hidden":false,"merged":[[90,7,90,8],[90,4,90,5],[8,4,8,5],[40,7,40,8],[40,4,40,5],[67,7,67,8],[67,4,67,5]]}
[]
[]
[]
[]
[]
[null,null,"Resultados"]
[]
[]
[null,null,"RESULTADOS COSTES ANUALES",null,"Usuario",null,null,"Datos estadísticos",{"$f":"DE!$AJ$2","v":"08/01/2024"}]
[null,null,null,null,"Euros","%",null,"Euros","%"]
[null,null,"COSTES TOTALES",null,{"$f":"E12+E21","v":0},100,null,{"$f":"H12+H21","v":0},100]
[null,null,"COSTES POR TIEMPO",null,{"$f":"IFERROR(SUM(E13:E20),0)","v":0},{"$f":"IFERROR(E12*F11/E11,0)","v":0},null,{"$f":"IFERROR(SUM(H13:H20),0)","v":0},{"$f":"IFERROR(H12*I11/H11,0)","v":0}]
[null,null,"Leasing","A",{"$f":"IFERROR('Costes Adquisición'!H13+0,0)+IFERROR('Costes Adquisición'!H37+0,0)+IFERROR('Costes Adquisición'!H61+0,0)+IFERROR('Costes Adquisición'!H85+0,0)","v":0},{"$f":"IFERROR(E13*F$11/E$11,0)","v":0},"A",{"$f":"IFERROR('Costes Adquisición'!J13+0,0)+IFERROR('Costes Adquisición'!J37+0,0)+IFERROR('Costes Adquisición'!J61+0,0)+IFERROR('Costes Adquisición'!J85+0,0)","v":0},{"$f":"IFERROR(H13*I$11/H$11,0)","v":0},null,"A",{"$f":"E13","v":0},0,"A",{"$f":"H13","v":0},0]
[null,null,"Amortización","B",{"$f":"IFERROR(0+'Costes Adquisición'!H29,0)+IFERROR(0+'Costes Adquisición'!H53,0)+IFERROR(0+'Costes Adquisición'!H77,0)+IFERROR(0+'Costes Adquisición'!H101,0)","v":0},0,"B",{"$f":"IFERROR(0+'Costes Adquisición'!J29,0)+IFERROR(0+'Costes Adquisición'!J53,0)+IFERROR(0+'Costes Adquisición'!J77,0)+IFERROR(0+'Costes Adquisición'!J101,0)","v":0},0,null,"B",0,0,"B",0,0]
[null,null,"Gastos financieros","C",{"$f":"IFERROR(0+'Costes Adquisición'!H31,0)+IFERROR(0+'Costes Adquisición'!H55,0)+IFERROR(0+'Costes Adquisición'!H79,0)+IFERROR(0+'Costes Adquisición'!H103,0)","v":0},0,"C",{"$f":"IFERROR(0+'Costes Adquisición'!J31,0)+IFERROR(0+'Costes Adquisición'!J55,0)+IFERROR(0+'Costes Adquisición'!J79,0)+IFERROR(0+'Costes Adquisición'!J101,0)","v":0},0,null,"C",0,0,"C",0,0]
[null,null,"Coste total anual del conductor","D",{"$f":"'Costes Personal'!H11","v":0},0,"D",{"$f":"'Costes Personal'!J11","v":""},0,null,"D",0,0,"D","",0]
[null,null,"Dietas y otros complementos retributivos del personal de a bordo","E",{"$f":"'Costes Personal'!H17+'Costes Personal'!H21","v":0},0,"E",{"$f":"'Costes Personal'!J17+'Costes Personal'!J21","v":0},0,null,"E",0,0,"E",0,0]
[null,null,"Seguros","F",{"$f":"'Seguros y Costes Fiscales'!H27","v":0},0,"F",{"$f":"'Seguros y Costes Fiscales'!J27","v":0},0,null,"F",0,0,"F",0,0]
[null,null,"Costes fiscales","G",{"$f":"'Seguros y Costes Fiscales'!H47","v":0},0,"G",{"$f":"'Seguros y Costes Fiscales'!J47","v":0},0,null,"G",0,0,"G",0,0]
[null,null,"Gestión y comercialización","H",{"$f":"'Costes Indirectos'!H11+'Costes Indirectos'!H13+'Costes Indirectos'!H15","v":0},0,"H",{"$f":"'Costes Indirectos'!J11+'Costes Indirectos'!J13+'Costes Indirectos'!J15","v":0},0,null,"H",0,0,"H",0,0]
{"$rows_left_out":78}
{"sheet":"Coste Servicio","index":10,"n_rows":37,"n_cols":8,"rows_kept":37,"cut":false,"hidden":false,"merged":[[10,7,10,10]]}
[]
[]
[]
[]
[]
[null,null,"Coste de un servicio"]
[]
[]
[null,null,"Coste de un servicio"]
[]
[null,null,"Denominación del servicio"]
[]
[null,null,"Kilómetros recorridos en este servicio (km)",null,null,null,null,{"$f":"H15+H17","v":0}]
[]
[null,null,"Kilómetros en carga (km) "]
[]
[null,null,"Kilómetros en vacío (km) "]
[]
[null,null,"Consumo medio por kilómetro en este servicio (litros / 100 km) "]
[]
{"$rows_left_out":17}